program: Gaussian 09
title: 000225165
version: EM64L-G09RevD.01
frameworkgroup: C1[X(C8H7BrO3)]
method: RPBEPBE
basis: SDD
operation: Freq
keyword: #p
keyword: freq=noraman
keyword: PBEPBE/SDD
title: #p freq=noraman PBEPBE/SDD
converged: YES YES NO NO
title: Mulliken charges:
elementType: Br O O O C C C C C C C C H H H H H H H
charge: -0.049606 -0.372799 -0.455485 -0.213727 0.552496 0.155239 -0.432279 0.178052 -0.316245 -0.381564 -0.857359 0.110498 0.290459 0.243959 0.226151 0.289718 0.284678 0.361977 0.385838
chargesum: 0.00000
title: Mulliken charges with hydrogens summed into heavy atoms:
elementType: Br O O O C C C C C C C C
charge: -0.049606 -0.010822 -0.069647 -0.213727 0.552496 0.155239 -0.141820 0.178052 -0.072286 -0.155413 -0.282962 0.110498
polarizability: 1.73949185e+02 -3.73722858e+00 1.18108793e+02 4.34952417e+00 -2.05303446e+00 6.60341994e+01
1716.lowfreq: -7.5810 -4.9537 -0.0007 -0.0007 -0.0005 2.3602 30.1718 32.0361 65.2813
frequency: 30.1592 32.0176 65.2573 123.5313 170.5313 190.8895 288.1300 321.2579 357.7651 382.8483 411.1237 431.3407 476.3030 497.0521 509.8561 566.5253 607.3465 614.8351 697.0140 709.9218 766.4890 771.7130 817.1653 870.2110 916.6074 942.1020 957.7416 986.5727 1087.6310 1106.6632 1147.1833 1172.6307 1202.4532 1237.4790 1262.1928 1298.0355 1312.2914 1403.1665 1410.9558 1460.6335 1501.0322 1596.1235 1613.8208 1656.1639 3069.4704 3118.2613 3147.5427 3153.6276 3171.9570 3535.7151 3546.9435
redmass: 10.3559 8.2921 9.3212 5.1761 6.3851 5.1595 3.6965 6.4596 4.4702 9.4998 1.5287 1.8058 5.6366 4.8561 4.2670 1.6483 1.9944 4.9142 5.2895 5.0972 4.4593 5.2977 1.5842 1.6647 3.7297 1.5347 1.3878 4.0029 1.6595 1.2387 1.4035 1.1541 1.1675 2.2970 2.8686 1.8745 1.9875 5.1275 4.4243 1.1443 2.9712 6.5070 6.6297 8.8022 1.0577 1.0884 1.0969 1.1110 1.0923 1.0642 1.0659
irintensity: 1.7054 0.9905 1.1022 3.4908 3.0313 0.3991 5.4431 14.3895 0.7521 4.8856 109.3023 21.1220 20.1853 44.6342 61.8930 15.0514 208.4418 31.2503 2.0781 1.9763 4.6771 6.4391 42.3562 9.2127 55.6681 9.1333 4.4938 208.9546 103.7930 53.8132 152.8980 15.2232 73.0294 80.1004 32.9271 82.7939 49.4017 10.2167 3.4680 6.7106 29.5071 50.6030 18.6589 379.7816 15.0749 11.7042 8.5037 3.2603 1.6023 44.7248 50.1469
temp: 298.150 k
press: 1.00000 atm
elementType: 35 8 8 8 6 6 6 6 6 6 6 6 1 1 1 1 1 1 1
symmnumber: 1
zpe: 351249.2 jmol-1
zpe.correction: 0.133784 hartree
zpe.thermalcorrener: 0.145205 hartree
zpe.thermalcorrenthalpy: 0.146149 hartree
zpe.thermalcorrgfe: 0.093591 hartree
zpe.sumelectzpe: -547.317741 hartree
zpe.sumelectthermal: -547.306320 hartree
zpe.sumelectthermalent: -547.305375 hartree
zpe.sumelectthermalfe: -547.357934 hartree
dipole: 0.0258 2.6610 1.9739
dipole: 3.3133
quadrupole: -96.3951 -59.0998 -78.6341
quadrupole: -2.1268 2.3548 -2.0435
quadrupole: -18.3521 18.9432 -0.5911 -2.1268 2.3548 -2.0435
hfenergy: -547.4515246 hartree
pointgroup: C01 [X(C8H7Br1O3)]
dipole: -0.2317047 -1.0080977 0.7933019 debye
dipolederiv: -0.6955033 0.210277 -0.1497003 0.2313656 -0.2270643 0.0578202 -0.594768 0.2309889 -0.3895753 -1.0589312 0.746821 0.1070165 0.6104458 -0.4482526 -0.0545857 0.1772537 -0.1238303 -0.395466 -0.3164112 0.080412 -0.0195245 -0.1065269 -1.3042689 -0.158053 -0.0384452 -0.1540083 -0.448914 -1.1110542 0.0185662 0.1201233 -0.1540115 -0.5483382 -0.0266368 0.1299359 -0.0441329 -0.3389112 -0.4006127 -0.0416734 -0.0538177 -0.0434569 -0.3579763 0.0066761 0.1901965 -0.0810736 -0.1490249 -0.6531062 -0.3308704 0.0171262 0.0326792 -0.4427134 -0.021802 0.1297924 -0.0003994 -0.0082973 0.4087807 0.1941556 -0.0019044 0.0108214 0.0224325 0.0360418 -0.1318993 -0.0258598 -0.0805455 1.058893 -0.7010775 -0.1590015 -0.3153601 0.528477 0.0722756 -0.1915591 0.163482 0.1325768 0.1508363 -0.1122994 -0.0407368 -0.0895566 0.31064 0.0036986 -0.0513163 0.0967494 -0.0820409 -0.5731945 0.2906347 0.0240779 -0.1361451 0.0932282 0.0377312 0.0527486 -0.0187775 -0.1816158 1.028395 -0.3584691 0.3252031 -0.4156983 0.2397657 -0.1351204 0.5645171 -0.2249453 0.5342438 1.5720571 0.2622025 -0.1611892 0.4831786 1.6490438 0.1955752 -0.184001 0.1611477 0.2943544 0.1410789 0.0423551 0.017026 0.0385223 0.0238547 -0.0120532 -0.0006373 -0.0162469 0.1341414 -0.0276263 -0.0913133 0.023356 -0.0736589 0.0512388 -0.0048656 0.0099969 0.0059313 0.132327 0.0496723 0.0703726 0.021859 0.0392507 -0.1026175 -0.0292564 0.0269903 -0.040944 0.1644333 0.0168098 -0.0301194 -0.0903999 0.0591291 -0.0193147 -0.0480367 -0.0908284 -0.0324212 -0.0337382 -0.0454323 0.0203396 -0.0138779 -0.0528837 0.0211331 0.0992464 -0.043763 0.0847614 -0.0484217 0.3453062 -0.2019837 -0.010025 -0.1404965 0.1485633 -0.0177779 -0.0136904 0.0052417 0.3778964 0.1100424 -0.06833 0.0443891 0.0224018 0.3621689 -0.0008773 0.0594767 0.0143367 0.3865777 unknown
polarizability: 171.5756507|-11.4435447|120.3383662|6.3855707|-0.3050856|66.1781607 unknown
InChI: InChI=1S/C8H7BrO3/c9-4-5-1-2-7(10)6(3-5)8(11)12/h1-3,10-11H,4H2
charge 0 multiplicity 1
19 atoms
Br -4.017215 0.995511 -1.037262
O  2.14132 -1.835769 -0.432412
O  1.673976 2.385784 0.170584
O  3.189649 0.716135 -0.367522
C  -1.625068 -0.064359 0.38398
C  0.816067 0.156126 0.00521
C  -0.456584 0.721972 0.277878
C  0.903606 -1.260122 -0.169004
C  -1.511189 -1.470219 0.205938
C  -0.267155 -2.058499 -0.06595
C  -2.943863 0.565193 0.688022
C  2.011701 1.035702 -0.093694
H  -0.512192 1.807342 0.400303
H  -2.405741 -2.100105 0.271895
H  -0.192313 -3.145449 -0.199465
H  -2.860418 1.546124 1.175694
H  -3.632308 -0.091441 1.238344
H  2.055847 -2.818239 -0.536283
H  2.501677 2.929512 0.081144
