program: Gaussian 09
title: 000225164
version: EM64L-G09RevD.01
frameworkgroup: C1[X(C7H9N5O2)]
method: RPBEPBE
basis: SDD
operation: Freq
keyword: #pfreq=noraman
keyword: PBEPBE/SDD
title: #p freq=noraman PBEPBE/SDD
converged: NO YES NO NO
title: Mulliken charges:
elementType: O O N N N N N C C C C C C C H H H H H H H H H
charge: -0.289579 -0.268079 -0.211553 -0.160945 -0.112704 -0.403809 -0.619136 0.181198 0.136185 0.149199 0.129436 0.167965 -0.669277 -0.614943 0.358678 0.311788 0.233828 0.235639 0.245369 0.245301 0.270220 0.347000 0.338219
chargesum: 0.00000
title: Mulliken charges with hydrogens summed into heavy atoms:
elementType: O O N N N N N C C C C C C C
charge: -0.289579 -0.268079 -0.211553 -0.160945 -0.112704 -0.045131 0.066082 0.181198 0.136185 0.149199 0.129436 0.167965 0.111979 0.145947
polarizability: 1.62775300e+02 5.12457772e+00 1.37769134e+02 8.06476257e-03 -7.95165927e-03 5.64979159e+01
1716.lowfreq: -9.0963 -5.5029 0.0008 0.0009 0.0012 4.7373 84.7962 97.3800 107.7738
frequency: 84.7950 97.3792 107.7734 121.1308 156.1447 180.4260 200.1674 216.9136 262.9547 271.5634 287.3918 304.2088 357.3454 364.9409 414.1724 423.0610 449.4338 524.4448 551.1270 620.3646 663.3513 680.0906 686.0058 703.7921 714.7778 731.2887 750.1611 821.2619 948.3814 1004.0893 1037.1094 1105.3153 1126.2774 1131.9850 1164.2769 1197.1615 1211.1570 1273.8424 1287.4982 1352.7661 1381.2877 1405.4224 1419.8094 1455.3300 1473.3602 1477.8027 1485.7572 1494.5308 1511.6780 1544.9674 1583.2550 1634.7179 1652.3332 1666.5670 2973.4125 3006.6324 3058.4777 3096.0877 3101.7471 3136.2814 3535.0977 3576.5762 3722.1639
redmass: 4.2080 2.8850 1.1271 5.3318 1.0581 4.3104 4.0575 3.6355 2.7597 1.7814 3.1713 3.6070 8.5360 7.1830 7.1780 5.7553 1.1519 6.8143 5.9876 3.3293 5.2926 3.2504 4.6238 10.3172 4.5300 7.1777 2.9996 4.6249 2.5249 3.6065 2.0856 2.8018 1.2968 1.2969 3.6877 4.5136 2.7087 7.6347 4.9996 1.7801 4.3365 1.9708 1.3139 2.0418 1.2012 1.0427 1.1817 1.0434 3.0396 4.0254 1.9492 3.7139 4.1364 6.9359 1.0344 1.0333 1.1027 1.1025 1.1007 1.1014 1.0769 1.0451 1.1051
irintensity: 0.6058 0.6390 0.0668 0.5452 8.5179 0.3901 12.6552 33.5997 3.2543 90.0533 19.5788 0.7838 11.6721 8.3836 0.7213 23.9000 186.1632 1.9210 24.9474 5.8699 2.6883 26.5878 11.1999 4.0561 7.0362 6.0245 108.3363 5.6940 1.0568 2.1415 6.0875 104.5421 0.2141 0.2951 12.8071 42.0658 34.3388 57.6918 10.8413 29.8047 10.8974 47.9131 3.5738 262.1610 62.4130 18.0720 56.0675 19.2713 56.3442 178.1390 24.9558 939.5881 52.6158 676.0144 62.6872 34.5718 26.3407 19.9897 1.9349 0.5022 71.1145 134.6262 50.2369
temp: 298.150 k
press: 1.00000 atm
elementType: 8 8 7 7 7 7 7 6 6 6 6 6 6 6 1 1 1 1 1 1 1 1 1
symmnumber: 1
zpe: 454459.1 jmol-1
zpe.correction: 0.173094 hartree
zpe.thermalcorrener: 0.186222 hartree
zpe.thermalcorrenthalpy: 0.187166 hartree
zpe.thermalcorrgfe: 0.134162 hartree
zpe.sumelectzpe: -695.377851 hartree
zpe.sumelectthermal: -695.364723 hartree
zpe.sumelectthermalent: -695.363779 hartree
zpe.sumelectthermalfe: -695.416783 hartree
dipole: -6.8901 -2.8383 0.0046
dipole: 7.4518
quadrupole: -69.8775 -85.6970 -82.3842
quadrupole: 2.2450 0.0146 0.0511
quadrupole: 9.4420 -6.3774 -3.0646 2.2450 0.0146 0.0511
hfenergy: -695.5509451 hartree
pointgroup: C01 [X(C7H9N5O2)]
dipole: 2.7558923 -0.9992042 0.042333 debye
dipolederiv: -0.6438795 -0.1929702 -0.0010068 -0.0747017 -1.4869544 0.0103315 -0.002057 0.0090266 -0.3758463 -1.5891109 -0.0746747 -0.013241 -0.1259305 -0.5012623 -0.000147 -0.0138309 0.000355 -0.388403 -0.5797289 -0.2825689 -0.0012848 -0.0833906 -0.6440616 0.0063661 -0.0069315 -0.0048369 -0.1217988 -1.265779 -0.2795032 -0.0102752 0.3344742 -0.6643699 0.0102551 -0.0165379 0.0030838 -0.1609354 -1.3662373 0.274122 -0.0153704 -0.0198784 -0.3986892 0.0014935 -0.0132941 0.0057455 -0.2835261 -1.0996052 -0.3116491 -0.0054605 -0.5651883 -0.7127936 -0.0026599 -0.0031552 0.0007051 -0.3602827 -1.4568011 0.6955617 -0.0146598 0.4666818 -0.4719762 0.0038671 -0.0055645 0.0036153 -0.7260715 0.1136191 0.4150879 -0.0016716 0.321214 -1.1094117 0.0171541 -0.0000378 0.0203565 -0.0702932 1.2743871 0.1969105 0.0124248 -0.4017103 0.6659201 -0.0118578 0.0199081 -0.0059747 0.0909178 1.8230754 -0.6335364 0.025091 -0.1200804 0.773222 -0.0084495 0.0173751 -0.0120886 0.2151766 1.3969394 -0.0189793 0.0141705 0.0324392 1.9253089 -0.0163055 0.0129594 -0.0178489 0.2532852 2.0741719 0.0052929 0.0213559 -0.0037483 1.0407804 -0.0090861 0.0233199 -0.0084433 0.2837647 0.3059838 0.2417067 -0.0040049 0.2827658 0.2058528 -0.0002415 -0.0024273 0.0023771 0.2538823 0.0746122 0.1629218 -0.0036241 0.1463511 0.4851515 -0.0017659 -0.0036065 -0.0016866 0.2106448 0.1821046 -0.0586719 -0.0011886 -0.0557232 0.1994194 0.0008483 -0.0013423 0.0007365 0.3367299 0.1747355 0.1050025 0.0006059 -0.0410239 0.0510937 0.000144 0.0022017 0.0018088 0.1378084 -0.0518672 -0.0855609 -0.0906784 -0.0082828 0.0698445 0.0560098 -0.1242223 -0.0146407 -0.0564275 -0.0502885 -0.0850815 0.090524 -0.009532 0.0668217 -0.057276 0.1248096 0.0138047 -0.0565453 0.1129447 0.0489596 -0.0810418 -0.0168966 -0.021762 0.0476077 -0.0401619 0.0944897 -0.0504083 0.1099794 0.0532858 0.0834776 -0.0147221 -0.0255522 -0.0487578 0.0442828 -0.0939523 -0.043822 -0.0237013 -0.0769961 -0.0008416 0.0554558 0.1490482 0.0004081 -0.0025597 -0.0011885 0.1307596 0.2226031 -0.0469419 -0.0019343 -0.1006751 0.265372 0.000365 -0.0021474 0.0020841 0.3953527 0.2618429 -0.0517172 -0.001366 0.0021022 0.1389978 0.0016966 -0.0069802 0.0024719 0.3860382 unknown
polarizability: 163.1534461|-4.0208814|137.3630822|1.281841|-1.0528517|56.5258222 unknown
InChI: InChI=1S/C7H9N5O2/c1-11-3-4(9-6(11)8)12(2)7(14)10-5(3)13/h10H,8H2,1-2H3
charge 0 multiplicity 1
23 atoms
O  -0.064838 2.949306 -0.037308
O  -3.601391 -0.144605 -0.04716
N  1.848953 0.424646 0.013715
N  -1.417886 -1.032635 -0.009725
N  0.960447 -1.695978 0.030641
N  -1.780462 1.327022 -0.042395
N  3.367632 -1.471624 0.052477
C  0.439358 0.561148 -0.008072
C  -0.056351 -0.754411 0.002759
C  2.101066 -0.939614 0.032587
C  -0.400874 1.721002 -0.02899
C  -2.350929 0.033753 -0.033581
C  2.827774 1.519464 -0.000217
C  -1.899965 -2.426133 0.002801
H  -2.462961 2.090743 -0.059321
H  2.270481 2.469668 -0.006726
H  3.467441 1.488811 0.901571
H  3.461519 1.471954 -0.905456
H  -1.543563 -2.942835 0.909591
H  -1.522363 -2.966333 -0.881431
H  -2.999396 -2.395825 -0.010654
H  3.454019 -2.483619 0.06635
H  4.200591 -0.891906 0.062342
