program: Gaussian 09
title: 000225202
version: EM64L-G09RevD.01
frameworkgroup: C1[X(C19H32O4)]
method: RPBEPBE
basis: SDD
operation: Freq
keyword: #pfreq=noraman
keyword: PBEPBE/SDD
title: #p freq=noraman PBEPBE/SDD
converged: YES YES NO NO
title: Mulliken charges:
elementType: O O O O C C C C C C C C C C C C C C C C C C C H H H H H H H H H H H H H H H H H H H H H H H H H H H H H H H H
charge: -0.291841 -0.255779 -0.313993 -0.307958 0.007102 -0.397093 -0.394286 -0.361506 -0.321957 -0.354080 -0.719423 0.030389 -0.698102 -0.730352 -0.481650 0.396080 0.034661 -0.367626 0.226654 -0.229252 -0.372125 -0.554937 -0.530431 0.171289 0.209106 0.172137 0.200461 0.207914 0.180811 0.194243 0.191039 0.240704 0.192812 0.195812 0.202065 0.212573 0.246269 0.202664 0.209721 0.209807 0.214973 0.232726 0.224699 0.242255 0.237021 0.222328 0.251015 0.228211 0.251364 0.218720 0.250127 0.269715 0.220604 0.256496 0.227824
chargesum: 0.00000
title: Mulliken charges with hydrogens summed into heavy atoms:
elementType: O O O O C C C C C C C C C C C C C C C C C C C
charge: -0.291841 -0.255779 -0.313993 -0.307958 0.178391 -0.015850 0.014089 0.013548 0.109786 0.034544 -0.058516 0.233053 -0.063601 -0.030671 -0.022300 0.396080 0.034661 -0.116611 0.226654 -0.001041 -0.120761 0.183625 0.174493
polarizability: 2.26734033e+02 -1.92478001e+01 2.16619264e+02 2.25650576e+00 -1.50797718e-03 2.10466870e+02
1716.lowfreq: -29.4352 -10.4856 -0.0008 -0.0007 -0.0005 1.8176 5.0868 18.2183 25.7356
frequency: -27.0727 17.4185 25.6739 31.9569 35.3327 41.2881 55.5467 73.8572 78.7298 93.8431 101.1448 123.2942 126.1718 132.6301 141.2659 165.9606 175.0239 184.3120 189.4491 193.8319 212.7085 224.9566 232.8201 238.9973 263.1369 269.5183 286.3108 300.4740 312.8487 330.7102 352.5815 374.4738 405.5824 415.9871 445.3977 475.5795 498.3086 514.3037 540.3292 557.4690 564.4483 596.7039 624.5351 679.4814 722.6383 746.1361 758.5532 762.3568 776.4753 781.2974 795.2135 809.6672 835.4076 876.2625 893.2191 899.4403 911.3652 918.0070 921.2835 938.1687 939.2077 963.2925 970.5416 999.9563 1008.3479 1018.5404 1032.7158 1047.1548 1069.5450 1071.3736 1076.0902 1080.0804 1082.5840 1114.5279 1116.0673 1126.5790 1127.7015 1142.4244 1147.0003 1155.6003 1165.2086 1171.9058 1173.6444 1210.5731 1229.6700 1230.9324 1238.6213 1245.9692 1258.9023 1261.4721 1273.0432 1286.8139 1301.8311 1312.8693 1316.4792 1337.4491 1342.7671 1345.6818 1346.7619 1356.4814 1365.1034 1377.8769 1386.7725 1388.7912 1393.0962 1417.3568 1429.5047 1445.0787 1452.3040 1458.0084 1459.6722 1460.2870 1461.9676 1464.9723 1465.2675 1469.0628 1473.9886 1476.9787 1477.7458 1481.8491 1483.6290 1485.6936 1486.6883 1492.4743 1496.3445 1587.9027 1594.3157 2932.8954 2951.7026 2955.1449 2965.9895 2968.4536 2971.2762 2971.4532 2975.4636 2976.8259 2980.9220 2984.0019 2994.6463 3003.9549 3012.8344 3018.0131 3032.8134 3035.9245 3040.0549 3065.9558 3068.0435 3069.1752 3070.2837 3080.0720 3081.1677 3087.9021 3104.3477 3110.5277 3116.3257 3120.1191 3130.2777 3147.9767 3167.3766
redmass: 2.1041 3.3452 2.7740 3.5712 4.7211 3.8851 2.9690 2.9212 3.6404 3.2447 3.1515 2.2239 2.6750 2.3642 2.9663 1.2452 2.6902 1.1548 2.1315 2.2820 2.7238 1.5341 1.1990 1.3310 4.0430 3.0395 3.9605 2.7107 2.3911 2.4899 4.7225 2.7853 4.3201 2.5522 5.6776 3.4755 3.4014 3.7334 5.3797 3.2396 3.4721 4.9890 3.1016 5.4191 1.1041 3.3622 1.6532 1.9883 1.2241 4.2002 2.2740 2.6846 1.7431 4.4724 1.8817 1.4820 1.6149 2.5695 2.1823 2.2050 6.6118 1.7879 1.7029 2.2700 3.6282 1.5605 2.0205 2.8110 1.9814 2.1775 2.1844 1.9091 2.3236 1.9396 1.2395 1.3580 2.0050 2.1879 1.6112 1.3438 1.6836 1.5959 2.1485 1.4752 1.2906 1.7175 1.2420 1.4008 2.2357 1.2665 1.2295 1.0962 1.2217 1.3281 1.2298 1.3320 1.5467 1.4586 1.2507 1.5829 4.8012 1.2741 1.2737 1.2185 1.2122 1.4022 1.3116 1.7016 1.2479 1.1066 1.0729 1.2678 1.2202 1.1888 1.1011 1.0682 1.0608 1.0567 1.0559 1.0641 1.0583 1.0653 1.0796 1.0621 1.0515 7.1083 6.6227 1.0798 1.0608 1.0610 1.0606 1.0625 1.0317 1.0359 1.0379 1.0299 1.0836 1.0603 1.0946 1.0362 1.1002 1.0595 1.1000 1.1029 1.1019 1.0990 1.1006 1.1031 1.0992 1.1060 1.0991 1.1033 1.0995 1.1003 1.1037 1.1029 1.0864 1.0924 1.0986
irintensity: 0.0478 0.4231 0.1564 0.5066 0.1574 0.0879 0.0916 0.0502 0.1016 5.8048 3.7548 3.0118 7.2208 2.1343 0.6836 0.7437 0.9807 0.4276 3.2178 2.8981 6.4921 2.5293 0.4322 0.3919 9.2943 5.3963 2.6084 0.9887 5.6616 2.0819 0.8442 5.5349 10.9667 0.0228 2.7130 2.6638 4.3270 14.1109 0.8548 2.4073 2.5967 2.4331 1.3073 26.9772 8.2124 31.0361 4.3679 10.5216 7.1540 31.0008 7.6104 62.9527 20.9628 7.2421 6.0966 11.4856 40.9776 43.8673 28.8427 26.2158 91.9325 7.9658 3.8738 49.9394 45.3406 6.2036 0.2588 2.7909 30.8863 70.6515 22.7916 67.9282 78.4449 13.0384 7.3998 4.5680 16.6450 3.1594 10.9399 0.4264 17.1766 19.7607 5.2464 0.4792 15.8147 44.9664 5.7304 22.8116 55.4386 7.6023 0.1327 1.1657 0.8501 0.3208 21.1819 0.5081 2.0827 4.2706 2.5746 0.2626 8.9243 1.6703 49.6470 11.5227 7.2894 10.6529 4.8758 72.5016 33.4510 4.7973 12.4055 2.1315 3.9431 5.7258 1.8374 5.6368 6.7166 6.0927 7.2287 2.1417 22.2152 2.3565 14.1219 14.7566 8.1183 10.4549 1.1944 14.8560 5.4224 16.3575 79.2994 35.9265 108.5323 18.2066 33.6266 44.8918 58.7031 25.2632 4.0885 9.7631 0.6256 40.6178 27.8453 60.5939 45.4039 40.7148 93.2096 28.2021 53.3405 8.7370 54.6149 11.0854 25.5693 22.6077 20.9326 22.1363 3.1258 12.0433 14.7925
temp: 298.150 k
press: 1.00000 atm
elementType: 8 8 8 8 6 6 6 6 6 6 6 6 6 6 6 6 6 6 6 6 6 6 6 1 1 1 1 1 1 1 1 1 1 1 1 1 1 1 1 1 1 1 1 1 1 1 1 1 1 1 1 1 1 1 1
symmnumber: 1
zpe: 1246335.0 jmol-1
zpe.correction: 0.474704 hartree
zpe.thermalcorrener: 0.501480 hartree
zpe.thermalcorrenthalpy: 0.502424 hartree
zpe.thermalcorrgfe: 0.415762 hartree
zpe.sumelectzpe: -1042.220928 hartree
zpe.sumelectthermal: -1042.194152 hartree
zpe.sumelectthermalent: -1042.193208 hartree
zpe.sumelectthermalfe: -1042.279870 hartree
dipole: -0.2314 -0.1180 -0.6030
dipole: 0.6566
quadrupole: -136.0805 -143.6304 -133.1284
quadrupole: -3.7786 -2.5800 -1.4257
quadrupole: 1.5326 -6.0173 4.4847 -3.7786 -2.5800 -1.4257
hfenergy: -1042.6956319 hartree
pointgroup: C01 [X(C19H32O4)]
dipole: 0.0941553 -0.017912 0.2398873 debye
polarizability: 225.4615528|19.6619778|217.8252104|0.0628369|-0.844706|210.533404 unknown
InChI: InChI=1S/C19H32O4/c1-6-8-10-16(7-2)13-22-15(3)23-14-17-11-9-12-18(20-4)19(17)21-5/h9,11-12,15-16H,6-8,10,13-14H2,1-5H3
charge 0 multiplicity 1
55 atoms
O  1.017831 1.168474 0.136477
O  -0.397612 2.805105 -1.000599
O  -2.362984 0.535298 1.604648
O  -3.189045 -2.168432 0.964303
C  2.549792 -0.60069 -0.652113
C  3.815331 0.169707 -0.183707
C  2.067867 -1.639691 0.398284
C  5.102671 -0.683019 -0.10961
C  1.434094 0.384799 -1.054013
C  6.352684 0.148838 0.260371
C  0.970653 -2.599269 -0.112569
C  0.755839 2.57544 -0.121155
C  7.63993 -0.699922 0.341101
C  0.657417 3.262777 1.243537
C  -1.740254 2.438221 -0.477708
C  -2.133517 1.00372 -0.78477
C  -2.444048 0.094604 0.25985
C  -2.214762 0.557045 -2.128266
C  -2.87185 -1.23116 -0.047564
C  -2.58781 -0.769967 -2.43094
C  -2.926814 -1.663146 -1.389094
C  -1.29377 -0.137396 2.393716
C  -4.343049 -1.800631 1.817508
H  2.809978 -1.156998 -1.582147
H  3.61085 0.626865 0.805165
H  3.997047 1.012862 -0.884647
H  2.937291 -2.240097 0.729306
H  1.705347 -1.091934 1.29035
H  5.272659 -1.179326 -1.088701
H  4.982522 -1.495676 0.634666
H  1.803321 1.081803 -1.835512
H  0.543727 -0.134824 -1.452657
H  6.486444 0.95682 -0.488032
H  6.178372 0.653145 1.232961
H  1.309004 -3.14092 -1.016913
H  0.716045 -3.353717 0.654505
H  0.037775 -2.06693 -0.369043
H  1.57827 3.003519 -0.731397
H  7.851598 -1.191693 -0.627298
H  7.542993 -1.494341 1.10519
H  8.51808 -0.082317 0.605565
H  1.638692 3.22347 1.746038
H  0.364764 4.318423 1.112718
H  -0.077559 2.760656 1.894463
H  -1.816555 2.629226 0.605208
H  -2.412386 3.133449 -1.01161
H  -1.959389 1.258394 -2.930621
H  -2.633112 -1.105957 -3.472405
H  -3.243239 -2.691626 -1.590501
H  -1.373265 0.283929 3.407999
H  -1.459945 -1.229545 2.415226
H  -0.310757 0.09791 1.948406
H  -5.266467 -1.761701 1.208622
H  -4.176279 -0.825874 2.309398
H  -4.421115 -2.604897 2.56491
