program: Gaussian 09
title: 000225111
version: EM64L-G09RevD.01
frameworkgroup: C1[X(C15H20ClN3)]
method: RPBEPBE
basis: SDD
operation: Freq
keyword: #p
keyword: freq=noraman
keyword: PBEPBE/SDD
title: #p freq=noraman PBEPBE/SDD
converged: YES YES NO NO
title: Mulliken charges:
elementType: Cl N N N C C C C C C C C C C C C C C C H H H H H H H H H H H H H H H H H H H H
charge: -0.060794 -0.433495 -0.295814 -0.047843 -0.014675 -0.455113 -0.376041 -0.707424 -0.360025 0.391565 0.262907 -0.334409 -0.027538 -0.336964 -0.387837 -0.295291 -0.625674 -0.275822 -0.089554 0.209485 0.213608 0.187414 0.224886 0.198377 0.292418 0.217684 0.243473 0.211770 0.171339 0.207065 0.253424 0.229946 0.194780 0.233801 0.286825 0.225751 0.189259 0.223960 0.254577
chargesum: 0.00000
title: Mulliken charges with hydrogens summed into heavy atoms:
elementType: Cl N N N C C C C C C C C C C C C C C C
charge: -0.060794 -0.141076 -0.042391 -0.047843 0.194810 -0.054091 0.047221 -0.034498 0.018379 0.391565 0.262907 -0.104463 -0.027538 -0.142184 -0.154036 -0.008466 0.013296 -0.021244 -0.089554
polarizability: 2.60555464e+02 -3.53639260e+01 2.10855953e+02 -1.88160539e+01 -2.82304104e+01 1.38729356e+02
1716.lowfreq: -7.9702 -5.9990 -0.0016 -0.0016 -0.0014 2.9352 15.7308 25.5055 42.5255
frequency: 15.6805 25.4857 42.4828 58.2010 76.5083 93.9888 104.2978 122.1422 128.1943 141.8713 191.3290 207.2532 232.0695 235.0408 237.7859 254.5676 281.3076 287.1253 336.7690 364.8184 395.8426 425.1964 434.2552 442.9981 484.2800 502.5134 513.0788 525.9947 577.5911 615.7792 641.2603 642.7212 652.7238 742.3390 753.1525 756.7751 805.6197 817.1303 825.2883 846.4205 865.0327 878.0449 896.0316 928.9993 935.9926 950.9266 964.3637 995.2173 1015.4537 1046.7897 1062.4984 1068.4077 1083.3077 1098.8417 1106.7017 1128.8459 1143.0102 1161.5674 1168.5044 1184.2542 1205.4739 1210.2799 1244.2404 1259.6111 1268.1887 1278.5782 1308.3990 1313.5342 1329.6919 1339.5966 1348.5167 1369.0375 1373.0465 1388.1760 1391.0352 1412.9953 1435.2002 1440.7814 1449.7420 1457.4993 1464.9376 1466.4336 1473.9982 1477.9164 1481.5851 1489.8503 1498.3644 1529.7855 1556.6975 1581.9728 1609.5159 2822.1957 2869.0965 2948.4507 2968.4254 2980.6494 2986.6905 2989.8392 3011.6472 3020.5488 3048.2089 3075.1234 3078.0695 3087.8620 3116.1850 3117.4179 3173.5056 3174.2694 3183.1870 3449.8631 3559.8279
redmass: 5.2970 4.8497 2.1978 2.9952 2.9136 3.8052 3.9075 2.8402 3.8100 2.1534 3.2688 2.8555 1.2586 4.7829 1.2281 4.4517 4.3551 3.4158 3.3495 2.4212 2.4761 2.8603 2.3099 3.6591 3.6049 3.2705 3.0003 5.6783 7.5563 5.9778 3.5239 3.2589 1.6120 2.1559 1.6034 1.7947 2.5153 2.7088 1.4636 3.0565 1.5931 3.4128 1.5019 1.3547 2.1309 1.4102 1.8487 1.7206 3.0707 2.3003 1.8939 2.4332 1.6733 1.6305 2.3331 1.8496 2.1198 1.6725 2.5644 2.4075 1.7168 1.9520 1.4513 1.3468 1.2535 1.0949 1.4865 1.7813 1.7183 1.6514 1.4788 2.3595 1.5149 1.2480 3.9267 2.5752 1.1507 2.4770 1.1998 1.5324 1.1509 1.0777 1.1316 1.1065 1.1994 1.0717 1.0708 4.5162 4.0668 6.6368 6.7636 1.0716 1.0565 1.0663 1.0660 1.0368 1.0829 1.0808 1.0751 1.0936 1.1011 1.0992 1.0999 1.0997 1.0883 1.0899 1.0933 1.0950 1.0933 1.0745 1.0756
irintensity: 0.3094 1.0976 2.0484 0.8153 1.0878 0.1198 0.4384 2.3830 0.1054 0.4578 2.1209 0.6835 0.0765 0.2029 1.4600 0.7638 2.3426 3.1383 9.5853 15.6990 25.9518 27.6102 43.3605 7.0898 12.3379 8.8998 3.5731 1.3512 11.6513 0.3672 7.7834 46.9805 75.7921 10.1863 2.7164 19.5804 31.0335 17.6815 32.4991 45.3269 6.1113 31.0737 25.2766 0.0547 6.8674 0.9482 5.7096 5.7959 1.9799 8.6425 12.6425 1.4009 5.9071 4.8892 27.5351 32.7412 5.1106 18.5493 35.1034 30.5649 2.1532 23.6833 3.0475 7.0290 3.8402 2.4045 2.9588 6.1374 6.8292 75.3686 10.8593 21.1841 8.6409 35.3627 63.4691 7.3688 1.6524 46.0544 22.1057 69.8718 9.0604 10.5182 16.1190 15.6551 1.9427 16.9707 6.8834 96.7663 148.1022 357.8874 78.4015 104.6640 162.0056 23.3120 12.6831 24.3240 34.2231 43.8394 51.9896 6.4539 68.6008 36.1793 42.7894 36.8691 18.4089 29.2111 23.4000 5.3166 0.8292 1.0772 20.8878
temp: 298.150 k
press: 1.00000 atm
elementType: 17 7 7 7 6 6 6 6 6 6 6 6 6 6 6 6 6 6 6 1 1 1 1 1 1 1 1 1 1 1 1 1 1 1 1 1 1 1 1
symmnumber: 1
zpe: 847173.9 jmol-1
zpe.correction: 0.322671 hartree
zpe.thermalcorrener: 0.342257 hartree
zpe.thermalcorrenthalpy: 0.343201 hartree
zpe.thermalcorrgfe: 0.272228 hartree
zpe.sumelectzpe: -1206.486948 hartree
zpe.sumelectthermal: -1206.467363 hartree
zpe.sumelectthermalent: -1206.466419 hartree
zpe.sumelectthermalfe: -1206.537392 hartree
dipole: -6.2075 -0.2617 2.8810
dipole: 6.8485
quadrupole: -137.4963 -115.4402 -124.6565
quadrupole: -0.8356 -3.1103 -0.8312
quadrupole: -11.6320 10.4242 1.2078 -0.8356 -3.1103 -0.8312
hfenergy: -1206.8096198 hartree
pointgroup: C01 [X(C15H20Cl1N3)]
dipole: 2.4559077 -0.1428421 1.0990982 debye
polarizability: 253.9274006|-39.3018314|217.4500269|19.4561354|27.6873257|138.7633457 unknown
InChI: InChI=1S/C15H20ClN3/c1-11(4-3-8-17-2)19-14-7-9-18-15-10-12(16)5-6-13(14)15/h5-7,9-11,17,19H,3-4,8H2,1-2H3
charge 0 multiplicity 1
39 atoms
Cl -5.057446 3.04221 0.452249
N  0.703974 -0.833038 0.635254
N  5.140844 1.719289 -1.027293
N  -3.077028 -1.419212 -1.309956
C  1.842839 -1.776365 0.606364
C  3.152533 -0.996027 0.87662
C  3.544041 -0.018833 -0.253404
C  1.649656 -2.936154 1.615294
C  4.774295 0.84014 0.098542
C  -0.517404 -1.03064 0.016436
C  -1.576035 -0.035103 0.142785
C  -0.797285 -2.173661 -0.769192
C  -2.829635 -0.288335 -0.539091
C  -1.439945 1.173591 0.895676
C  -2.063829 -2.307405 -1.398758
C  -3.892316 0.668104 -0.432511
C  6.329821 2.559454 -0.798196
C  -2.483577 2.099938 0.992155
C  -3.704841 1.822816 0.317441
H  1.901755 -2.195529 -0.418244
H  3.96598 -1.731812 1.028489
H  3.052921 -0.448615 1.840035
H  3.763904 -0.582091 -1.180542
H  2.685144 0.644792 -0.485858
H  0.806174 -0.032398 1.258718
H  2.449767 -3.690159 1.499464
H  0.67761 -3.437691 1.465916
H  1.681407 -2.55696 2.653457
H  4.570963 1.405804 1.047282
H  5.639647 0.179158 0.310325
H  4.335069 2.266389 -1.358015
H  -0.058608 -2.967129 -0.903471
H  -0.505954 1.414425 1.417834
H  -2.263607 -3.197976 -2.007774
H  -4.826455 0.450515 -0.955846
H  7.218985 1.914093 -0.66947
H  6.263782 3.220115 0.101906
H  6.509579 3.198812 -1.680521
H  -2.370126 3.020888 1.5702
