program: Gaussian 09
title: 000225122
version: EM64L-G09RevD.01
frameworkgroup: C1[X(C19H27NO2)]
method: RPBEPBE
basis: SDD
operation: Freq
keyword: #p
keyword: freq=noraman
keyword: PBEPBE/SDD
title: #p freq=noraman PBEPBE/SDD
converged: YES YES NO NO
title: Mulliken charges:
elementType: O O N C C C C C C C C C C C C C C C C C C C H H H H H H H H H H H H H H H H H H H H H H H H H H H
charge: -0.146060 -0.174047 -0.101353 -0.333862 -0.359956 -0.374139 -0.378645 -0.373309 -0.050959 -0.015224 0.244056 0.258162 -0.335694 -0.336948 -0.358627 -0.358693 -0.369468 -0.374192 -0.210033 -0.210280 -0.696113 -0.695492 0.269266 0.209950 0.200107 0.222284 0.201741 0.225621 0.182300 0.219347 0.178303 0.183490 0.186669 0.186775 0.185653 0.200358 0.194271 0.199896 0.194787 0.279243 0.278364 0.240609 0.240177 0.215562 0.209464 0.210387 0.216054 0.210027 0.210173
chargesum: 0.00000
title: Mulliken charges with hydrogens summed into heavy atoms:
elementType: O O N C C C C C C C C C C C C C C C C C C C
charge: -0.146060 -0.174047 -0.101353 -0.064596 0.050101 0.049886 0.029276 0.024341 -0.050959 -0.015224 0.244056 0.258162 0.034465 0.035480 0.036002 0.035989 -0.090225 -0.095828 0.030576 0.029897 -0.060699 -0.059239
polarizability: 2.99332035e+02 1.52745248e+01 1.86336741e+02 -2.32564944e+00 8.87260174e+00 2.00503242e+02
1716.lowfreq: -11.8199 -7.7426 -2.4993 -0.0005 -0.0003 0.0006 12.7941 18.6035 23.2208
frequency: 7.1001 18.4247 23.0504 26.9936 35.3293 50.6011 63.0168 83.4912 90.2824 110.2891 120.7748 125.0023 127.2076 129.6117 157.6142 177.2995 188.4716 228.9022 229.7477 232.9509 235.5873 289.7031 307.7836 328.6935 344.0486 368.1268 403.5116 426.6637 435.0781 485.8831 503.8778 515.8887 538.0426 553.4789 591.7598 676.7114 696.7437 725.5337 726.2791 752.9783 755.6043 765.3438 770.1301 818.5651 835.3490 838.9163 842.4831 859.9274 891.9181 901.3352 906.0249 938.6296 959.8768 961.4053 981.4122 996.6545 1009.1778 1011.6279 1014.0365 1027.9869 1045.0095 1059.7171 1075.8336 1076.4595 1079.0150 1101.4692 1116.4767 1119.8385 1124.7225 1146.8206 1161.5790 1170.4157 1184.9711 1195.4373 1210.5003 1227.7459 1238.0247 1247.9090 1252.7584 1266.3616 1279.0630 1279.9039 1282.2671 1286.7345 1289.9789 1299.4352 1315.1753 1323.4115 1337.2244 1350.7380 1352.4660 1372.0917 1373.2792 1388.2617 1390.3414 1402.5928 1450.3866 1450.8140 1461.9878 1463.9696 1465.0961 1466.2513 1472.4562 1475.3648 1476.9576 1477.1760 1481.4137 1484.8300 1488.3843 1490.2082 1587.3313 1591.7079 1621.9603 1653.2303 2899.7132 2915.0166 2951.8039 2952.4978 2960.5680 2967.3664 2967.9854 2969.5412 2971.6236 2971.8649 2975.4581 2993.0124 2993.8561 3004.7273 3018.8753 3023.1782 3031.2592 3049.3458 3051.9420 3068.3871 3068.6785 3070.9296 3071.4501 3136.0193 3149.7232 3161.2821 3171.0211
redmass: 3.6888 4.3813 4.5420 5.2546 1.7007 1.6543 3.7141 2.7810 3.5578 2.3007 4.8566 1.9772 2.4712 3.1574 4.3561 4.5528 3.2433 1.1624 1.1111 5.6129 2.6186 3.5031 5.0012 3.9786 4.9703 3.4754 3.2277 4.4670 3.3016 3.4467 4.8487 7.5798 7.0250 3.7011 3.5297 5.8644 6.7450 1.0697 1.0680 1.1292 1.1424 3.3261 1.4198 5.0351 2.1602 1.3624 1.7989 3.1318 1.8800 1.9361 1.5214 5.2805 1.2911 1.2439 1.4662 3.1849 3.5158 1.3617 2.9296 2.2347 2.8879 2.7386 2.4358 2.4081 2.5198 2.1755 2.3907 2.0706 1.9512 1.4522 1.7954 1.2113 1.9490 1.8149 1.4223 1.7997 2.1301 1.4286 1.3840 1.2604 1.2740 1.4674 1.2055 1.0879 1.1159 1.2066 1.3506 1.4761 1.5601 1.5964 1.6247 1.3883 1.4427 1.2170 1.2161 7.9334 2.4992 2.5104 1.0747 1.0735 1.0731 1.0733 1.0724 1.0688 1.0427 1.0440 1.0756 1.0756 1.0893 1.0915 7.7960 7.5027 9.7318 12.5381 1.0679 1.0700 1.0590 1.0586 1.0646 1.0714 1.0587 1.0654 1.0371 1.0371 1.0639 1.0969 1.0966 1.0890 1.0978 1.1024 1.0943 1.1013 1.1007 1.1007 1.1008 1.0992 1.0992 1.0863 1.0901 1.0955 1.1004
irintensity: 0.1863 1.6239 0.6511 0.4606 0.1288 0.1309 2.2367 0.0733 1.4492 0.7083 0.1152 0.1141 1.2988 1.6786 0.6877 0.3298 0.4784 0.0994 0.0027 0.8674 0.8168 1.5861 3.1093 0.9949 6.0183 8.1473 1.6732 0.1335 1.7349 2.6986 1.5252 1.6834 7.4642 30.6939 5.2400 6.8826 1.8230 9.9651 10.1926 2.6099 1.5031 14.1140 83.2434 10.3098 3.1461 5.1808 3.1821 1.8236 5.5832 12.4280 1.8974 4.6728 5.8200 1.1114 2.4329 28.0108 1.4772 0.0544 2.1330 15.5793 1.4048 8.5965 1.4128 0.1949 2.8203 54.9602 3.6887 4.4922 27.6017 7.9962 11.1025 16.4720 3.9607 12.7171 2.6373 66.2630 58.0777 21.0020 2.3950 0.5132 2.2635 2.8799 4.0873 3.2331 1.6954 5.6973 2.8788 15.4009 10.7715 0.8371 0.6256 20.5934 7.6131 12.7434 12.6336 1.7533 2.0098 0.9741 0.4854 2.2542 0.6661 0.5398 4.2070 1.4126 12.1152 12.4087 1.3177 0.9351 27.9285 16.1125 164.0378 10.0669 116.7105 49.0535 43.2857 51.5477 7.9908 12.9267 18.5335 38.9927 26.7027 58.5205 49.8513 28.7955 57.5510 4.3992 5.3235 23.8008 11.4920 10.0463 8.9976 52.3082 71.3370 95.2534 94.8824 55.8882 54.9980 1.9748 4.7069 5.8859 27.4504
temp: 298.150 k
press: 1.00000 atm
elementType: 8 8 7 6 6 6 6 6 6 6 6 6 6 6 6 6 6 6 6 6 6 6 1 1 1 1 1 1 1 1 1 1 1 1 1 1 1 1 1 1 1 1 1 1 1 1 1 1 1
symmnumber: 1
zpe: 1096195.8 jmol-1
zpe.correction: 0.417519 hartree
zpe.thermalcorrener: 0.441647 hartree
zpe.thermalcorrenthalpy: 0.442591 hartree
zpe.thermalcorrgfe: 0.358402 hartree
zpe.sumelectzpe: -943.726059 hartree
zpe.sumelectthermal: -943.701931 hartree
zpe.sumelectthermalent: -943.700987 hartree
zpe.sumelectthermalfe: -943.785176 hartree
dipole: -2.6218 -0.8005 -0.2901
dipole: 2.7566
quadrupole: -105.9267 -131.4577 -145.6942
quadrupole: 5.2890 -2.0434 -2.0444
quadrupole: 21.7662 -3.7648 -18.0013 5.2890 -2.0434 -2.0444
hfenergy: -944.143578 hartree
pointgroup: C01 [X(C19H27N1O2)]
dipole: -0.8936369 -0.5960235 -0.1496119 debye
polarizability: 281.4892403|44.0126458|203.7551386|-1.9210011|8.7066764|200.9276393 unknown
InChI: InChI=1S/C19H27NO2/c1-3-5-9-13-20(14-10-6-4-2)17-18(21)15-11-7-8-12-16(15)19(17)22/h7-8,11-12,17H,3-6,9-10,13-14H2,1-2H3
charge 0 multiplicity 1
49 atoms
O  -0.995833 -0.393297 2.219801
O  -0.710157 -1.035098 -2.567641
N  0.6922 0.330616 -0.202084
C  -0.162554 -0.838975 -0.115814
C  0.025226 1.593432 -0.603436
C  2.048815 0.100631 -0.758389
C  0.60327 2.830406 0.117472
C  2.984114 -0.643047 0.219715
C  -1.191706 -0.836168 1.061837
C  -1.051035 -1.175239 -1.362892
C  -2.454004 -1.449523 0.549566
C  -2.377841 -1.634035 -0.858525
C  -0.112111 4.1369 -0.294931
C  4.403813 -0.841224 -0.357752
C  0.476218 5.391253 0.39081
C  5.343947 -1.61142 0.597482
C  -3.609133 -1.820689 1.270078
C  -3.455231 -2.196715 -1.576697
C  -4.690609 -2.378591 0.552135
C  -4.613967 -2.565518 -0.857427
C  -0.251811 6.692817 -0.009085
C  6.766747 -1.791454 0.02564
H  0.47528 -1.731828 0.059351
H  0.068089 1.744206 -1.708241
H  -1.048094 1.512253 -0.339712
H  2.004053 -0.444298 -1.729551
H  2.488463 1.091363 -0.975034
H  0.515467 2.670334 1.208932
H  1.686004 2.92522 -0.103649
H  3.027806 -0.073284 1.167727
H  2.560708 -1.637678 0.47386
H  -0.053392 4.262624 -1.396854
H  -1.192012 4.060773 -0.04776
H  4.340316 -1.384368 -1.324263
H  4.850124 0.149286 -0.587386
H  0.427565 5.260391 1.490857
H  1.552417 5.474419 0.135181
H  5.397463 -1.07473 1.566452
H  4.903855 -2.605536 0.817778
H  -3.655482 -1.670135 2.353313
H  -3.38423 -2.333664 -2.6604
H  -5.604307 -2.669735 1.081812
H  -5.470153 -2.997497 -1.387164
H  0.189117 7.574538 0.491467
H  -0.19409 6.85979 -1.101476
H  -1.322537 6.648153 0.266327
H  7.418458 -2.345135 0.726347
H  6.742798 -2.35144 -0.928447
H  7.240257 -0.81148 -0.173729
