program: Gaussian 09
title: 000225106
version: EM64L-G09RevD.01
frameworkgroup: C1[X(C12H20N2O4S)]
method: RPBEPBE
basis: SDD
operation: Freq
keyword: #p
keyword: freq=noraman
keyword: PBEPBE/SDD
title: #p freq=noraman PBEPBE/SDD
converged: YES YES NO NO
title: Mulliken charges:
elementType: S O O O O N N C C C C C C C C C C C C H H H H H H H H H H H H H H H H H H H H
charge: 0.920273 -0.451525 -0.467973 -0.508051 -0.559549 -0.312881 -0.687316 -0.405395 -0.374236 -0.027630 -0.052616 -0.108937 -0.734528 -0.692738 -0.229575 -0.208636 -0.393656 -0.389941 0.512169 0.229325 0.244508 0.268332 0.213120 0.260451 0.262736 0.228293 0.201544 0.249352 0.192350 0.220281 0.239549 0.289757 0.279701 0.328596 0.367213 0.232754 0.232338 0.316121 0.316417
chargesum: 0.00000
title: Mulliken charges with hydrogens summed into heavy atoms:
elementType: S O O O O N N C C C C C C C C C C C C
charge: 0.920273 -0.122929 -0.100760 -0.508051 -0.559549 -0.312881 -0.054778 0.068438 0.107216 0.232822 0.210120 -0.108937 -0.055339 -0.040558 0.060182 0.071065 -0.160902 -0.157602 0.512169
polarizability: 2.67273778e+02 1.62549849e+01 1.59609290e+02 -9.98265737e-01 1.16431970e+01 1.49293046e+02
1716.lowfreq: -10.5349 -5.1453 -0.0013 -0.0011 0.0015 9.3768 26.4324 36.3027 40.6422
frequency: 26.0544 36.0601 40.5455 51.6216 63.0319 79.8229 99.7387 116.5907 144.8699 158.7525 173.8753 194.6962 201.6328 214.3373 226.6443 240.0103 261.0732 273.8374 287.1511 301.1605 318.7021 344.2779 374.5707 393.9064 402.9919 412.0477 412.9335 422.5545 429.2545 436.3063 441.6364 465.3504 516.6929 524.2507 585.6717 614.2772 623.4707 682.0517 718.2904 777.3394 793.3600 808.3883 811.3607 815.5031 836.0944 842.8771 877.8613 900.1409 912.9712 920.2992 945.7562 946.9347 972.4713 983.1403 1017.7663 1021.6208 1054.3594 1056.3595 1066.6141 1102.4633 1113.7720 1124.7289 1130.4257 1149.6874 1183.9897 1208.9708 1265.0608 1280.2331 1290.3667 1299.8755 1301.1730 1320.0275 1323.2563 1346.8603 1355.7213 1378.7020 1380.0614 1390.4048 1395.4623 1397.9483 1406.5601 1421.4225 1434.1796 1457.3176 1469.0054 1474.0263 1480.1302 1491.3827 1583.8489 1614.9104 1649.1567 2959.8408 2969.2926 2983.0507 2987.9822 3020.3087 3030.0597 3048.9308 3058.9442 3071.7162 3085.2476 3094.5001 3101.3403 3133.3883 3136.0096 3158.5881 3166.1053 3350.4506 3537.8455 3560.9704 3699.5443
redmass: 4.4387 3.9992 4.1877 4.0448 4.1620 4.2575 4.6890 5.4056 5.2726 5.3351 5.0345 2.0802 1.5904 3.2059 1.9070 6.6302 1.5778 1.4909 2.3158 5.2396 5.3662 3.3468 4.4887 3.3374 3.5051 1.1038 2.4411 3.5612 2.0744 1.8054 1.5649 4.3982 3.2694 2.8542 5.5235 4.7346 6.8763 1.2702 2.9892 6.6510 2.9448 3.6941 3.4840 1.3045 1.8007 3.2196 1.8217 2.2343 1.9090 14.1977 2.1605 1.3782 1.3437 4.5386 1.4179 1.4354 2.5562 2.5350 2.3164 2.2945 2.0693 2.1647 1.1957 3.0537 1.1196 1.4240 1.2873 1.1756 1.2841 1.3022 1.2551 1.2606 2.4927 1.2168 1.1799 1.2453 1.2299 1.2058 1.4054 4.8925 1.0989 1.0768 3.8169 1.0490 1.0524 1.0464 1.0461 2.9451 7.3450 4.7532 1.2278 1.0624 1.0403 1.0546 1.0409 1.0859 1.0957 1.0909 1.1016 1.0939 1.0997 1.0992 1.0992 1.0889 1.0892 1.0958 1.0963 1.0686 1.0659 1.0453 1.1040
irintensity: 0.5926 1.7958 1.0364 1.5434 2.3435 2.5568 2.2375 1.7080 3.9846 2.6477 5.7650 3.9412 2.7797 35.6296 13.8868 18.3499 27.0796 72.3490 8.4418 8.5403 1.4545 5.1584 54.1189 24.0747 11.3732 1.5779 1.9457 25.2168 22.3309 47.9388 256.1175 62.7573 24.4598 10.5055 50.6320 184.4900 3.3418 146.9040 0.9262 48.7370 17.6425 5.5598 20.8024 4.7695 56.6854 86.9648 3.9688 14.3938 6.5332 76.6482 22.0168 0.0669 0.9767 4.2957 75.2451 1.0597 56.2461 53.5723 21.4253 27.4231 18.2609 21.1004 15.1183 20.3254 43.7468 14.4810 7.3501 54.8452 29.2165 6.5729 3.0174 14.2076 62.7248 4.9352 4.2840 21.7227 10.5117 20.4014 31.4018 7.6502 14.5277 12.3470 1.3917 8.1945 4.5572 13.2817 9.0139 76.9656 7.2111 167.0230 275.6376 13.9876 28.6898 8.1829 48.2184 2.4809 9.5011 5.4006 2.0138 27.6180 36.4469 24.6431 25.7642 11.5243 14.0772 6.8781 7.3329 187.8857 5.1758 117.2625 26.1336
temp: 298.150 k
press: 1.00000 atm
elementType: 16 8 8 8 8 7 7 6 6 6 6 6 6 6 6 6 6 6 6 1 1 1 1 1 1 1 1 1 1 1 1 1 1 1 1 1 1 1 1
symmnumber: 1
zpe: 819724.3 jmol-1
zpe.correction: 0.312217 hartree
zpe.thermalcorrener: 0.334061 hartree
zpe.thermalcorrenthalpy: 0.335006 hartree
zpe.thermalcorrgfe: 0.261169 hartree
zpe.sumelectzpe: -1276.060848 hartree
zpe.sumelectthermal: -1276.039003 hartree
zpe.sumelectthermalent: -1276.038059 hartree
zpe.sumelectthermalfe: -1276.111896 hartree
dipole: 8.8392 6.7740 -4.6999
dipole: 12.0875
quadrupole: -91.2884 -128.6835 -120.9971
quadrupole: -2.3922 7.0746 4.9316
quadrupole: 22.3679 -15.0272 -7.3407 -2.3922 7.0746 4.9316
hfenergy: -1276.3730647 hartree
pointgroup: C01 [X(C12H20N2O4S1)]
dipole: 3.1263512 -2.3067645 2.7423141 debye
polarizability: 258.4000885|-32.1730888|175.6206133|6.8447348|2.7476175|142.1554119 unknown
InChI: InChI=1S/C12H20N2O4S/c1-9(15)7-14(8-10(2)16)19(17,18)12-5-3-11(13)4-6-12/h3-6,9-10,15-16H,7-8,13H2,1-2H3
charge 0 multiplicity 1
39 atoms
S  -0.010852 1.011437 -0.693964
O  -3.163689 -1.555744 1.51004
O  -3.102945 1.465936 -1.417985
O  0.135998 2.604772 -0.963953
O  -0.644241 0.018069 -1.861069
N  -0.950237 0.85652 0.9131
N  5.504357 -1.163522 0.539961
C  -0.886797 -0.494933 1.514447
C  -2.202753 1.664203 0.909545
C  -1.786585 -1.645767 0.972577
C  -3.392363 1.226986 0.001376
C  1.65851 0.305589 -0.262244
C  -1.173199 -3.021165 1.291423
C  -4.621033 2.088304 0.325606
C  2.028053 -0.945065 -0.791016
C  2.5383 1.09491 0.503522
C  3.316669 -1.436948 -0.520937
C  3.823324 0.597694 0.775851
C  4.23192 -0.676978 0.271564
H  -1.107304 -0.350057 2.593351
H  0.17108 -0.815598 1.457857
H  -1.91491 2.692938 0.621374
H  -2.533107 1.677643 1.967583
H  -1.915021 -1.533549 -0.117218
H  -3.632368 0.163733 0.188133
H  -0.214124 -3.163278 0.760514
H  -0.978225 -3.134486 2.377168
H  -1.864436 -3.82204 0.977974
H  -4.96068 1.927256 1.365257
H  -4.390213 3.159713 0.181762
H  -5.443495 1.824528 -0.359957
H  1.324169 -1.498476 -1.421724
H  2.227207 2.080697 0.86305
H  -3.144909 -1.800337 2.471295
H  -2.405361 0.832961 -1.758165
H  3.625517 -2.405733 -0.929946
H  4.522735 1.196493 1.370445
H  5.812017 -2.057028 0.166279
H  6.168693 -0.61838 1.082326
