program: Gaussian 09
title: 000225092
version: EM64L-G09RevD.01
frameworkgroup: C1[X(C7H12O2S)]
method: RPBEPBE
basis: SDD
operation: Freq
keyword: #p
keyword: freq=noraman
keyword: PBEPBE/SDD
title: #p freq=noraman PBEPBE/SDD
converged: YES YES NO NO
title: Mulliken charges:
elementType: S O O C C C C C C C H H H H H H H H H H H H
charge: 0.180605 -0.469042 -0.218425 -0.510764 -0.000816 -0.403993 -0.454227 -0.432478 0.022302 -0.711725 0.305769 0.219056 0.235965 0.213310 0.206535 0.251974 0.219220 0.227077 0.365086 0.243903 0.256003 0.254666
chargesum: 0.00000
title: Mulliken charges with hydrogens summed into heavy atoms:
elementType: S O O C C C C C C C
charge: 0.180605 -0.103956 -0.218425 -0.204995 0.218239 0.045281 0.004282 0.013819 0.022302 0.042847
polarizability: 1.29351098e+02 -4.63189402e+00 9.42282961e+01 -1.29346270e+00 -3.61284105e+00 6.93467286e+01
1716.lowfreq: -5.6012 -0.0028 -0.0020 -0.0015 10.7927 14.5171 48.4047 69.0284 70.8713
frequency: 48.2493 68.9506 70.7984 102.5004 140.6730 202.3064 232.9728 271.3569 334.3824 378.8386 434.3693 467.9327 508.4132 522.2442 590.7334 596.0221 628.9224 766.0061 802.3746 844.8824 906.6836 914.3900 937.6975 966.3519 974.9523 1010.8847 1039.4721 1065.9789 1087.7280 1114.4421 1134.1444 1157.7273 1205.2310 1221.5733 1240.0960 1267.5951 1294.7107 1297.0031 1307.3115 1321.2676 1378.1075 1387.1379 1447.3519 1453.0686 1454.4756 1466.3667 1474.1801 1600.3570 2966.2591 2994.8378 2996.6550 3005.7862 3010.9757 3043.4121 3069.9087 3079.1555 3086.7192 3095.1185 3119.8334 3442.1593
redmass: 1.7589 1.7599 4.0355 2.9006 4.6020 2.6809 5.4600 3.2862 3.1794 3.6978 3.4305 7.6522 3.3710 2.8670 2.6054 3.7087 1.1090 3.7088 2.2630 2.0119 2.2963 2.3489 1.8343 2.7182 2.4440 1.5403 1.6633 2.1994 3.1291 2.1793 1.3619 1.5899 1.2547 1.2867 1.2115 1.2184 1.2202 1.3611 1.2359 1.4123 1.1905 1.4866 1.0554 1.0860 1.0673 1.0844 1.0987 9.2468 1.0846 1.0362 1.0637 1.0607 1.0677 1.0858 1.0999 1.1017 1.0963 1.1020 1.1017 1.0650
irintensity: 2.7252 0.7244 1.2713 1.3900 2.5379 2.4664 3.3642 3.9322 3.6218 3.5710 11.4366 0.9452 0.6846 2.1524 14.1342 54.6563 149.2337 15.2194 4.0332 10.9091 4.7448 7.0768 6.5574 17.0146 68.4685 6.9684 11.5256 9.4338 2.8489 151.1157 15.4965 17.4107 1.2371 15.2434 40.4453 7.8467 35.6533 0.7685 6.0709 10.5274 38.4110 61.0462 22.3796 11.4402 23.1269 12.9523 6.8270 161.9680 33.7404 2.0218 20.8448 38.8568 37.0597 2.2270 29.8317 36.4055 5.9843 31.3057 7.4909 78.8469
temp: 298.150 k
press: 1.00000 atm
elementType: 16 8 8 6 6 6 6 6 6 6 1 1 1 1 1 1 1 1 1 1 1 1
symmnumber: 1
zpe: 472824.2 jmol-1
zpe.correction: 0.180089 hartree
zpe.thermalcorrener: 0.191201 hartree
zpe.thermalcorrenthalpy: 0.192145 hartree
zpe.thermalcorrgfe: 0.142341 hartree
zpe.sumelectzpe: -821.656083 hartree
zpe.sumelectthermal: -821.644972 hartree
zpe.sumelectthermalent: -821.644028 hartree
zpe.sumelectthermalfe: -821.693831 hartree
dipole: -1.3966 -2.7301 0.5751
dipole: 3.1200
quadrupole: -57.2859 -76.6556 -66.7909
quadrupole: -2.8664 -0.3090 1.8284
quadrupole: 9.6249 -9.7448 0.1199 -2.8664 -0.3090 1.8284
hfenergy: -821.8361727 hartree
pointgroup: C01 [X(C7H12O2S1)]
dipole: 0.6974242 -0.6412525 -0.7805006 debye
dipolederiv: -0.5311373 -0.2564316 -0.1038571 -0.3861171 -0.4903411 -0.1545773 -0.1951068 -0.2344455 -0.1835054 -0.4275254 0.0370852 -0.0521513 0.1074474 -0.6725507 -0.1302945 -0.0493844 -0.1244887 -0.6371632 -0.620359 0.1269644 0.2513021 -0.155224 -0.7385504 -0.3686788 -0.0572175 -0.5438865 -0.7442829 0.4129236 0.138789 -0.0744826 0.1473149 -0.0090502 -0.0911222 -0.1961966 -0.0987843 0.0831559 0.2940289 0.0123882 0.0440911 -0.1881375 0.3750405 0.1405099 0.1179034 0.1029558 0.4355339 -0.0824943 -0.0228462 0.0358193 0.0921736 0.0860559 -0.0747689 0.1158524 0.0509595 0.1312592 -0.0855236 -0.0546024 -0.0358927 0.0193457 0.0057889 0.0040926 0.0759937 -0.0122811 0.1341565 0.0381837 0.0098676 0.0472504 -0.0368161 0.0072122 0.040322 -0.0560494 -0.0311176 0.1472583 0.9785025 0.3101374 -0.1211557 0.6802417 1.0217906 0.5560121 0.3041182 0.7767461 0.6769623 -0.4982126 -0.1212223 0.1141116 -0.1864326 -0.0471059 0.0291639 -0.0218844 -0.0336278 0.0151759 -0.0629218 -0.0352161 0.0013855 0.008306 0.0341373 -0.0268562 -0.0080585 0.0357739 -0.0618199 0.0095871 -0.0626769 0.0681286 -0.0462196 -0.0759904 0.0592259 0.0355351 0.0653204 -0.1468993 0.0321082 0.0835944 -0.0236564 0.0561999 -0.1311584 0.0488716 -0.0211898 0.0784524 0.0599858 0.0615775 0.008099 0.0191207 -0.011403 0.082273 0.0194929 0.0059271 -0.0415939 -0.1404521 0.0452682 -0.0105906 -0.0273281 -0.0261158 0.0410558 0.0223426 -0.1020492 0.0534302 -0.1487197 -0.0305813 0.0725111 0.0495296 0.0915939 0.0064521 -0.0389107 0.0858035 -0.053284 0.0516662 0.0694952 0.021727 -0.0083149 0.0243727 0.0485276 0.0177089 0.0493784 0.0614991 -0.1521791 -0.1274493 -0.1285955 -0.0471782 -0.10939 -0.0121312 -0.0383889 -0.0818349 -0.0616162 0.0536723 0.3150685 -0.1120681 -0.0820512 -0.079372 0.3749789 0.016564 -0.0344794 0.0132404 0.3205235 0.117602 -0.0176651 -0.0167661 0.01088 0.056416 -0.1050099 0.0464096 -0.0750978 -0.0232925 0.0157449 0.0100925 -0.054433 0.0359503 0.1078777 0.0436023 -0.0664479 0.0541333 0.0120942 0.0761142 -0.0093408 0.0165285 -0.0485983 -0.0707283 0.0306986 0.0529773 0.0177124 0.1168701 unknown
polarizability: 122.8271959|16.6310738|91.0507805|-5.8705887|11.0571315|79.048146 unknown
InChI: InChI=1S/C7H12O2S/c1-5(8)10-7-4-2-3-6(7)9/h6-7,9H,2-4H2,1H3
charge 0 multiplicity 1
22 atoms
S  1.358514 -0.758395 -1.031672
O  -1.102864 1.222291 1.158609
O  1.725626 1.277823 0.766045
C  -0.241624 -0.816855 -0.004099
C  -1.135609 0.472188 -0.097754
C  -1.12877 -2.006777 -0.439859
C  -2.577269 -0.056458 -0.318388
C  -2.531056 -1.562252 0.05269
C  2.237887 0.613925 -0.171846
C  3.64304 0.850871 -0.689484
H  0.078928 -0.933183 1.046406
H  -0.804868 1.115957 -0.938792
H  -0.790182 -2.966612 -0.013397
H  -1.136135 -2.105096 -1.542968
H  -2.862897 0.062416 -1.380174
H  -3.281727 0.527407 0.295993
H  -2.602327 -1.683551 1.14986
H  -3.346739 -2.14684 -0.407201
H  -0.148174 1.46707 1.316373
H  3.841631 0.310107 -1.628102
H  4.368201 0.513111 0.074321
H  3.800913 1.933052 -0.838466
