program: Gaussian 09
title: 000225080
version: EM64L-G09RevD.01
frameworkgroup: C1[X(C5H8N2O3S)]
method: RPBEPBE
basis: SDD
operation: Freq
keyword: #p
keyword: freq=noraman
keyword: PBEPBE/SDD
title: #p freq=noraman PBEPBE/SDD
converged: YES YES NO NO
title: Mulliken charges:
elementType: S O O O N N C C C C C H H H H H H H H
charge: 0.670634 -0.597627 -0.415208 -0.226024 -0.600193 -0.004886 -0.171650 -0.671978 0.153628 -0.643349 -0.093104 0.341201 0.283188 0.308710 0.374171 0.299054 0.296511 0.306932 0.389991
chargesum: 0.00000
title: Mulliken charges with hydrogens summed into heavy atoms:
elementType: S O O O N N C C C C C
charge: 0.670634 -0.597627 -0.025217 -0.226024 0.003250 -0.004886 0.169550 -0.080080 0.153628 0.029876 -0.093104
polarizability: 1.27831976e+02 -9.88134960e+00 9.87784502e+01 -2.82024189e-01 6.43429725e+00 8.00946957e+01
1716.lowfreq: -0.0024 -0.0020 -0.0013 4.3931 8.5793 15.3221 39.0135 48.5195 63.5354
frequency: 38.9681 48.5163 63.5072 100.6344 144.5254 164.8324 192.2024 244.8832 255.7190 293.0184 310.1292 371.8833 386.7866 394.9772 409.2870 468.5374 520.6378 579.1431 610.4918 617.0145 704.2072 780.2079 804.8598 844.3089 862.9711 900.0485 967.9213 985.8346 1044.4220 1088.9700 1144.8726 1171.6789 1187.9986 1227.7778 1246.3502 1277.1828 1301.4972 1398.0732 1411.6917 1428.1330 1655.1155 1657.5584 2171.1698 2835.3755 2890.0437 3055.3435 3108.3140 3150.2798 3436.5998 3517.9409 3555.4245
redmass: 9.4103 11.6613 4.3824 5.1205 6.0580 5.5681 4.3969 8.7174 3.7886 2.8975 1.6551 4.3632 3.4509 7.3701 3.4138 4.3313 4.0343 1.9643 3.8135 2.5578 4.3022 1.6798 10.7234 1.6621 3.1539 1.7094 4.9420 2.4568 2.2180 1.1738 1.1592 2.5893 1.2196 1.2474 1.2577 1.5653 1.6383 1.2752 1.1068 1.1102 4.0215 1.2790 12.3184 1.0810 1.0718 1.0564 1.0950 1.1105 1.0467 1.0643 1.0953
irintensity: 1.5748 2.1382 5.0284 11.9441 18.3996 5.2229 4.5624 5.8680 2.6582 7.5413 17.8946 12.6142 5.0970 16.6839 24.5464 15.7107 3.3947 90.2309 34.5200 43.6504 22.8144 156.8920 48.6421 73.4566 17.1459 7.8774 0.5869 49.3449 209.5356 3.5363 1.9853 12.7705 30.1562 3.4174 20.2082 8.2064 86.4553 1.2130 18.2648 7.0510 156.7894 159.0534 40.5587 82.7008 165.4921 2.9193 10.2819 0.2649 4.4772 28.4251 12.0586
temp: 298.150 k
press: 1.00000 atm
elementType: 16 8 8 8 7 7 6 6 6 6 6 1 1 1 1 1 1 1 1
symmnumber: 1
zpe: 353065.0 jmol-1
zpe.correction: 0.134475 hartree
zpe.thermalcorrener: 0.147135 hartree
zpe.thermalcorrenthalpy: 0.148079 hartree
zpe.thermalcorrgfe: 0.094466 hartree
zpe.sumelectzpe: -927.620799 hartree
zpe.sumelectthermal: -927.608139 hartree
zpe.sumelectthermalent: -927.607195 hartree
zpe.sumelectthermalfe: -927.660808 hartree
dipole: -2.3782 -0.0479 -0.0922
dipole: 2.3804
quadrupole: -77.0694 -85.4794 -68.4221
quadrupole: 3.1764 9.8081 -6.7187
quadrupole: -0.0791 -8.4891 8.5682 3.1764 9.8081 -6.7187
hfenergy: -927.7552744 hartree
pointgroup: C01 [X(C5H8N2O3S1)]
dipole: -0.8735087 -0.3255676 -0.0898673 debye
dipolederiv: 0.3172457 0.0940514 0.0255807 0.1013101 0.4735524 0.1833204 0.0069784 0.3211142 0.792274 -0.5486292 -0.0939122 -0.1151839 0.0240709 -0.3595234 0.0895699 0.1266771 -0.2440786 -0.7118169 -0.3562298 -0.1244536 -0.0667411 -0.1662174 -1.2333227 -0.2040842 -0.0794604 -0.1795542 -0.4184685 -1.062626 0.1744936 0.2022807 0.0268346 -0.6521753 -0.0998958 0.2689193 -0.1485837 -0.3985197 -0.6606099 -0.1216654 -0.0745972 -0.1230832 -0.5828557 -0.0290456 -0.0488575 -0.0851609 -0.1345563 -0.2829344 -0.0570507 -0.0464729 0.0496932 -0.1771708 0.0646735 -0.1919295 -0.1374301 -0.3484421 -0.2615281 -0.1651108 0.0889627 -0.0684179 0.4292637 0.0514449 0.2818878 0.078282 0.024449 0.1286012 0.0424536 0.072812 -0.0397099 -0.0561406 -0.019279 0.0124429 0.123243 -0.0758973 1.4389082 0.0287121 -0.2862963 0.275787 1.3701384 0.2869705 -0.3704313 0.3009264 0.3626946 -0.2177524 0.0083495 -0.1467603 0.0243256 -0.0116739 -0.1010629 -0.241668 -0.1192635 -0.1966391 0.0598348 0.0571912 0.1503038 -0.1390235 -0.1892572 -0.1554723 0.344831 0.1641055 0.3213659 0.32165 0.0378353 0.0202967 0.0128123 0.056986 -0.0091264 -0.244182 -0.06327 0.0744571 -0.0003543 -0.0214241 0.0088841 -0.0130382 0.0705502 -0.0517299 -0.013037 -0.0192536 -0.026602 0.0653095 -0.015751 0.0143465 0.0155673 -0.0142859 0.0162965 0.0467379 0.0098519 0.0867047 0.4480746 0.0279347 0.0258798 -0.0115788 0.0849443 -0.0339402 -0.0122465 -0.0294399 0.0264166 0.060178 -0.0508166 0.0164823 -0.0401137 0.093286 -0.0105139 -0.0005261 -0.0050717 0.0282648 0.2237619 0.1061696 0.0951939 0.0041898 0.1901866 0.0447718 0.0660644 0.0135277 0.1235798 0.2069124 0.1258422 -0.0536069 0.0524999 0.1797859 -0.0115673 -0.0525935 0.0121694 0.109949 0.1201878 -0.0528486 0.0686356 0.0140921 0.3277119 -0.0113301 0.1003931 0.0078862 0.3607864 unknown
polarizability: 117.4375617|17.4962874|87.6939386|8.904692|10.5300177|101.5736211 unknown
InChI: InChI=1S/C5H8N2O3S/c6-1-2-11(10)3-4(7)5(8)9/h4,8H,2-3,7H2
charge 0 multiplicity 1
19 atoms
S  1.489203 -0.265373 -0.641254
O  0.831478 0.041483 -2.145355
O  -2.583124 -1.923384 -0.299009
O  -3.634654 -0.011479 0.506911
N  -1.297304 1.566579 0.054155
N  2.852504 1.462084 2.497732
C  -1.280886 0.127467 -0.259009
C  -0.13073 -0.592974 0.453703
C  -2.618647 -0.565083 0.034572
C  1.831855 1.577456 0.062822
C  2.40759 1.533689 1.389173
H  -1.060743 0.021252 -1.35416
H  0.099825 -0.206626 1.458363
H  -0.238798 -1.687778 0.448442
H  0.802503 2.000751 0.047672
H  2.494053 2.016355 -0.6992
H  -1.78293 1.775103 0.93669
H  -1.693856 2.127957 -0.707916
H  -3.46994 -2.33818 -0.119432
