program: Gaussian 09
title: 000225072
version: EM64L-G09RevD.01
frameworkgroup: C1[X(C17H26N4O2)]
method: RPBEPBE
basis: SDD
operation: Freq
keyword: #p
keyword: freq=noraman
keyword: PBEPBE/SDD
title: #p freq=noraman PBEPBE/SDD
converged: YES YES NO NO
title: Mulliken charges:
elementType: O O N N N N C C C C C C C C C C C C C C C C C H H H H H H H H H H H H H H H H H H H H H H H H H H
charge: -0.290458 -0.269862 -0.188330 -0.082545 -0.165436 -0.219985 0.036114 -0.449744 -0.449896 -0.427313 -0.403485 -0.402766 -0.383794 -0.400545 -0.504546 0.189072 0.134352 0.085098 -0.653617 0.134640 0.196114 -0.616798 -0.602061 0.193177 0.202455 0.185802 0.190190 0.198095 0.195784 0.197800 0.191956 0.198022 0.197664 0.193062 0.200435 0.187994 0.207156 0.227629 0.214947 0.244133 0.236826 0.304132 0.238446 0.270658 0.246273 0.245698 0.268069 0.249927 0.249459
chargesum: 0.00000
title: Mulliken charges with hydrogens summed into heavy atoms:
elementType: O O N N N N C C C C C C C C C C C C C C C C C
charge: -0.290458 -0.269862 -0.188330 -0.082545 -0.165436 -0.219985 0.229290 -0.061486 -0.061610 -0.033728 -0.013507 -0.012040 0.004636 0.034240 -0.045466 0.189072 0.134352 0.085098 0.125788 0.134640 0.196114 0.145832 0.165394
polarizability: 2.91999819e+02 3.23027513e+00 2.14024109e+02 -2.76160598e+01 2.02678622e+00 1.58270440e+02
1716.lowfreq: -7.3300 -2.0889 -0.0006 -0.0001 0.0006 10.5191 12.3949 22.2219 24.6633
frequency: 9.3140 20.5745 24.4132 68.4916 72.2607 80.2398 89.0049 107.1043 107.7743 113.8363 123.9348 139.5026 146.4071 169.9164 199.7425 205.7563 221.3886 239.4122 269.0008 272.8893 299.5723 312.0077 321.3556 351.1940 364.8961 383.8458 394.6341 414.4431 419.2406 431.9632 449.6511 459.4648 490.2265 523.9160 553.7969 624.6781 653.7758 693.2268 704.4491 722.9799 729.5017 743.6538 767.4635 771.2264 782.2491 798.0225 825.8947 844.8238 882.2080 888.1475 910.7862 944.3589 959.9949 961.4162 998.2119 1011.0967 1030.0066 1046.6817 1052.7863 1052.9077 1055.5093 1075.1474 1091.5679 1104.3218 1115.0247 1126.2669 1130.1177 1132.3370 1155.2528 1170.6620 1186.8430 1194.2302 1213.9550 1227.3486 1232.7796 1248.6402 1254.2919 1258.9017 1263.7903 1275.5667 1287.5535 1292.7695 1300.4898 1310.8912 1323.4380 1333.2500 1338.2957 1339.4089 1341.4779 1353.9251 1358.9367 1362.5856 1392.5468 1413.4418 1426.6613 1437.1540 1454.5150 1455.4347 1461.3686 1463.0269 1463.7396 1467.6026 1468.1403 1473.5685 1475.5156 1476.7985 1478.2919 1479.6392 1481.9193 1488.6220 1494.4882 1505.6457 1571.9974 1613.8009 1646.6080 2930.3800 2945.3573 2948.6224 2956.8716 2964.0312 2964.1285 2964.9683 2979.0234 2991.4527 2993.4483 2997.4948 3007.2581 3012.1161 3013.8963 3021.8259 3025.6425 3026.6870 3038.4464 3039.6711 3071.7104 3085.2637 3096.2304 3103.7651 3112.5258 3138.4462 3138.8298
redmass: 3.0201 4.7400 4.6090 3.3817 3.6207 2.2323 1.0937 1.7949 2.3331 1.6039 1.7899 3.1523 1.9179 2.8680 3.4792 4.2377 1.7749 4.9835 4.1977 2.5222 2.7520 2.6330 2.4706 3.6044 4.1987 8.4028 5.4673 5.9882 2.4999 2.8526 2.9877 3.6933 5.3215 3.2722 2.3688 4.3962 9.9513 7.4324 10.5410 5.7955 1.2467 11.3826 2.8368 3.4519 1.5402 3.4038 1.6136 2.1886 1.6874 1.4987 1.9070 3.0160 3.8284 2.7397 1.7917 3.3163 2.6917 2.5055 2.4281 1.8050 1.2883 1.5382 1.5346 2.0113 2.4918 1.3045 1.3017 1.2998 2.2172 1.7471 1.5468 3.1999 4.6718 2.5659 1.4293 1.3764 1.2342 1.2727 2.2262 1.8558 1.2197 1.2314 6.5954 1.2709 1.3266 1.4001 1.4323 1.5286 1.5700 1.4995 1.7665 2.4542 2.3899 1.3467 1.2598 1.9207 1.0921 1.3741 1.1015 1.0941 1.0847 1.3224 1.1467 1.0435 1.1723 1.1275 1.0426 1.1059 1.1968 1.4897 1.0824 2.5452 7.8195 10.6506 9.6841 1.0801 1.0597 1.0625 1.0627 1.0612 1.0605 1.0678 1.0603 1.0609 1.0400 1.0945 1.0335 1.0328 1.0966 1.0987 1.0937 1.1021 1.1020 1.1024 1.1007 1.1020 1.1024 1.1021 1.1027 1.1023 1.1012
irintensity: 0.0965 0.1843 0.1396 0.1081 0.0321 1.0109 0.1114 0.2401 1.1994 0.9237 4.4682 3.0476 7.4243 0.9735 3.8713 5.6447 0.2533 0.8305 0.6492 2.3637 2.0683 0.2668 0.3175 12.6085 0.6004 15.7781 10.9222 4.4185 3.1582 0.3536 3.5270 3.1186 23.6416 1.7452 0.5402 2.9683 1.5162 2.1733 7.3531 4.2667 4.5171 13.8054 0.6487 0.3790 0.0446 0.7165 0.4817 7.3007 1.2533 13.4678 0.7763 7.6163 13.7636 28.9718 4.1329 8.7411 77.5164 1.4819 4.5993 2.9144 2.0368 6.5745 4.3862 1.8808 0.2575 0.6694 0.2801 0.1121 17.1179 2.1453 4.3786 48.2004 28.0228 3.8843 3.7175 7.3256 1.0149 2.5783 19.6584 27.3082 9.3061 2.0205 40.9341 0.3527 1.5960 0.3012 0.5485 0.9170 2.8594 0.5385 2.2902 8.2214 21.6110 9.9355 45.7021 208.3610 3.8258 95.6396 4.2154 7.8476 7.1997 20.1110 8.1209 17.9157 23.9218 12.2384 16.8195 8.9855 1.1510 87.0639 38.9272 84.1656 5.9371 600.2896 439.3820 4.1843 9.7705 25.9210 86.6011 27.8033 31.9466 31.2011 8.2488 13.9043 67.6245 11.3202 34.1161 31.1605 91.3260 67.9623 51.7432 17.6691 19.5205 145.8402 31.1201 19.4849 18.2946 17.9605 1.1581 0.8356 0.5713
temp: 298.150 k
press: 1.00000 atm
elementType: 8 8 7 7 7 7 6 6 6 6 6 6 6 6 6 6 6 6 6 6 6 6 6 1 1 1 1 1 1 1 1 1 1 1 1 1 1 1 1 1 1 1 1 1 1 1 1 1 1
symmnumber: 1
zpe: 1090790.4 jmol-1
zpe.correction: 0.415460 hartree
zpe.thermalcorrener: 0.438917 hartree
zpe.thermalcorrenthalpy: 0.439862 hartree
zpe.thermalcorrgfe: 0.359916 hartree
zpe.sumelectzpe: -1031.160842 hartree
zpe.sumelectthermal: -1031.137384 hartree
zpe.sumelectthermalent: -1031.136440 hartree
zpe.sumelectthermalfe: -1031.216386 hartree
dipole: 5.0045 -0.2437 -1.5502
dipole: 5.2448
quadrupole: -155.6812 -142.8321 -136.7142
quadrupole: -0.6585 2.9797 1.0298
quadrupole: -10.6054 2.2438 8.3616 -0.6585 2.9797 1.0298
hfenergy: -1031.5763017 hartree
pointgroup: C01 [X(C17H26N4O2)]
dipole: 1.9698618 0.0881907 0.6080617 debye
polarizability: 292.1221802|-3.5995736|213.8962267|27.2821798|3.2658793|158.2759606 unknown
InChI: InChI=1S/C17H26N4O2/c1-19-13(11-7-10-12-8-5-4-6-9-12)18-15-14(19)16(22)21(3)17(23)20(15)2/h12H,4-11H2,1-3H3
charge 0 multiplicity 1
49 atoms
O  -3.492396 2.690009 0.141148
O  -5.653828 -1.291019 -1.173798
N  -1.087022 0.844798 0.929804
N  -1.193701 -1.419397 0.6383
N  -3.48165 -1.48687 -0.305319
N  -4.551642 0.669293 -0.509606
C  4.597972 -0.42457 -0.063793
C  4.705465 0.983193 -0.7083
C  5.96955 -0.839326 0.532249
C  3.485143 -0.504595 1.012469
C  5.841228 1.059911 -1.757281
C  7.107434 -0.770171 -0.513516
C  7.2001 0.635553 -1.152749
C  2.050623 -0.33255 0.465161
C  0.976927 -0.506848 1.579126
C  -0.425283 -0.372479 1.067657
C  -2.351095 0.562275 0.382009
C  -2.376038 -0.83212 0.217913
C  -0.595782 2.182147 1.308589
C  -3.447235 1.422385 0.024813
C  -4.6214 -0.743364 -0.691189
C  -3.476778 -2.953896 -0.461904
C  -5.759375 1.418523 -0.926319
H  4.348117 -1.150058 -0.870855
H  3.745398 1.266592 -1.181986
H  4.899329 1.72597 0.095748
H  6.211229 -0.162269 1.379743
H  5.900347 -1.862876 0.952455
H  3.679322 0.263379 1.792028
H  3.552652 -1.489203 1.521537
H  5.596668 0.389493 -2.607562
H  5.907654 2.085772 -2.169383
H  8.072675 -1.042623 -0.043727
H  6.916757 -1.519243 -1.310218
H  7.988085 0.652043 -1.930656
H  7.499982 1.3704 -0.376548
H  1.936717 0.664002 -0.004201
H  1.859844 -1.081014 -0.328369
H  1.164448 0.228023 2.386437
H  1.07569 -1.513983 2.020917
H  0.354473 2.404783 0.794322
H  -1.356655 2.920184 1.010671
H  -0.440402 2.244058 2.400066
H  -4.447388 -3.245892 -0.888213
H  -3.328275 -3.438077 0.517799
H  -2.656761 -3.259889 -1.13294
H  -5.569276 2.482912 -0.725641
H  -6.636549 1.066861 -0.359164
H  -5.954499 1.255172 -1.998827
