program: Gaussian 09
title: 000225066
version: EM64L-G09RevD.01
frameworkgroup: C1[X(C15H24N4O2)]
method: RPBEPBE
basis: SDD
operation: Freq
keyword: #p
keyword: freq=noraman
keyword: PBEPBE/SDD
title: #p freq=noraman PBEPBE/SDD
converged: YES YES NO NO
title: Mulliken charges:
elementType: O O N N N N C C C C C C C C C C C C C C C H H H H H H H H H H H H H H H H H H H H H H H H
charge: -0.290071 -0.269995 -0.193408 -0.086678 -0.163125 -0.220333 -0.387038 -0.515540 -0.371927 0.213246 -0.361164 0.133529 0.079993 -0.354735 0.138819 -0.355257 -0.652772 0.198245 -0.616320 -0.695112 -0.601850 0.197732 0.214900 0.242649 0.215605 0.192110 0.223121 0.185097 0.186431 0.190236 0.188868 0.194791 0.194023 0.304057 0.236979 0.238130 0.246523 0.270769 0.245321 0.209968 0.210750 0.215768 0.249470 0.250040 0.268155
chargesum: 0.00000
title: Mulliken charges with hydrogens summed into heavy atoms:
elementType: O O N N N N C C C C C C C C C C C C C C C
charge: -0.290071 -0.269995 -0.193408 -0.086678 -0.163125 -0.220333 0.025594 -0.057286 0.043305 0.213246 0.010364 0.133529 0.079993 0.024369 0.138819 0.033557 0.126394 0.198245 0.146293 -0.058627 0.165815
polarizability: 2.33161058e+02 -2.27445249e+01 2.07124289e+02 -2.93118176e+01 -1.33649412e+01 1.61543197e+02
1716.lowfreq: -13.2481 -7.1695 -0.0005 0.0004 0.0008 4.2066 17.1059 20.3139 36.6205
frequency: 16.3710 19.9254 36.4950 54.8499 74.2805 81.5013 86.4231 88.3145 108.2285 114.2676 122.9005 124.7529 135.8676 148.1202 161.9581 199.0441 223.6077 236.2728 238.7429 245.6896 278.4429 297.1238 306.5925 347.6694 356.0822 381.7091 391.3437 402.7809 413.3478 430.6294 486.5036 497.4646 519.3892 618.4201 655.0359 683.2485 702.0907 709.0845 720.9858 733.3196 743.4863 748.9396 776.6659 798.6471 849.2627 882.3429 895.9475 936.0345 960.0674 972.9282 989.9005 1021.1703 1025.4686 1042.2770 1053.7940 1066.6974 1076.2243 1093.0893 1115.1110 1126.9274 1130.0836 1132.1021 1154.5145 1187.9448 1192.6736 1199.5801 1217.2611 1228.2392 1238.1861 1249.4825 1268.3186 1279.8583 1284.5901 1292.4825 1298.2136 1299.4801 1315.9564 1333.5373 1352.7189 1354.8414 1365.3458 1391.4646 1393.0108 1413.7116 1426.8073 1437.2767 1455.4201 1459.9806 1462.3965 1466.1200 1469.3232 1474.5798 1474.6163 1476.0029 1478.2056 1478.5515 1480.5739 1482.6926 1488.5096 1489.2700 1495.1936 1505.4715 1571.9347 1613.7874 1646.5367 2949.4023 2955.7410 2964.5708 2966.7519 2972.2398 2974.0961 2986.6596 2993.2788 2995.2995 3001.9923 3006.9237 3011.9202 3014.7945 3029.6482 3046.9197 3068.4263 3068.7362 3071.1473 3085.8660 3095.8121 3103.6419 3113.3338 3138.0392 3138.6536
redmass: 4.4793 4.5387 1.5439 3.6370 3.5857 2.0995 2.0228 1.4699 1.7748 1.6209 2.1092 1.7965 2.5696 1.5501 2.9268 3.8271 3.3613 1.1507 4.5371 3.3384 2.5799 4.3784 2.6948 4.3390 4.0939 7.9348 5.9867 3.1011 5.4640 4.5945 3.8818 4.3228 5.1187 4.5152 9.3235 5.3696 6.4215 3.2227 1.1316 1.8378 11.3349 1.8817 3.9404 1.5235 2.1248 1.4321 1.7162 2.5915 5.3448 1.8158 1.8708 2.8497 2.7694 2.6258 2.9143 2.1242 2.3002 1.7299 2.0536 1.3186 1.3012 1.3012 2.1268 1.7600 2.2488 1.8878 4.1282 2.5283 1.3691 1.3949 4.5498 1.1856 1.0753 1.2437 1.3789 3.4035 1.3608 1.4444 1.8145 1.7536 2.2371 1.2172 2.3762 1.3456 1.2591 1.8881 1.3561 1.1174 1.0682 1.1257 1.2792 1.0788 1.0497 1.2107 1.0426 1.0424 1.2338 1.0856 1.1479 1.3413 1.1099 2.4872 7.8224 10.6443 9.6744 1.0589 1.0589 1.0604 1.0593 1.0366 1.0605 1.0964 1.0379 1.0611 1.0987 1.0335 1.0328 1.0991 1.1042 1.1040 1.0996 1.0999 1.0993 1.1019 1.1024 1.1021 1.1027 1.1023 1.1012
irintensity: 0.0396 0.2186 0.0137 0.0045 0.1400 1.0239 0.0324 0.1890 0.0320 2.7042 0.3376 6.0780 0.6956 6.6771 1.4787 5.2326 6.6359 0.0741 1.1486 0.2994 0.5563 0.3532 2.0097 7.3620 5.6253 10.9589 9.8688 6.7146 4.6733 5.8530 14.9221 7.4597 1.7476 2.6011 1.8743 3.9265 4.7979 5.6649 9.7339 2.7749 13.9364 1.4423 0.5271 4.4028 4.8684 0.3715 2.3231 2.5534 38.6211 0.4117 2.7930 13.1260 51.7771 18.1496 8.1891 8.4712 1.9704 16.6600 5.5714 1.0342 0.2768 0.1040 3.5822 3.3503 19.0702 53.2070 16.0983 2.4314 0.7407 4.0818 47.8119 1.1400 0.3777 4.1595 4.3237 43.5524 2.3772 6.2720 4.8823 4.5181 8.7245 11.7126 23.6349 10.7530 47.5995 162.3601 87.2799 11.4838 0.6051 0.8283 26.7656 8.5435 13.7426 24.7624 16.2355 12.6940 2.8396 9.5350 27.9259 68.3667 48.3442 70.7644 8.0122 582.6221 436.5500 5.3962 7.2064 12.9125 42.2976 32.7936 103.7780 2.5477 32.1523 49.6890 3.4426 34.2486 29.9975 12.4978 10.9846 125.0790 16.4208 98.1647 55.9115 19.2727 18.4223 17.8878 1.2601 0.8216 0.5262
temp: 298.150 k
press: 1.00000 atm
elementType: 8 8 7 7 7 7 6 6 6 6 6 6 6 6 6 6 6 6 6 6 6 1 1 1 1 1 1 1 1 1 1 1 1 1 1 1 1 1 1 1 1 1 1 1 1
symmnumber: 1
zpe: 994602.8 jmol-1
zpe.correction: 0.378824 hartree
zpe.thermalcorrener: 0.401969 hartree
zpe.thermalcorrenthalpy: 0.402913 hartree
zpe.thermalcorrgfe: 0.323836 hartree
zpe.sumelectzpe: -953.885201 hartree
zpe.sumelectthermal: -953.862057 hartree
zpe.sumelectthermalent: -953.861113 hartree
zpe.sumelectthermalfe: -953.940190 hartree
dipole: -3.7342 2.9828 0.9444
dipole: 4.8717
quadrupole: -137.4598 -125.1524 -128.6218
quadrupole: 1.4758 2.2379 3.4796
quadrupole: -7.0485 5.2589 1.7895 1.4758 2.2379 3.4796
hfenergy: -954.2640257 hartree
pointgroup: C01[X(C15H24N4O2)]
dipole: 1.4781575 1.169839 -0.3465718 debye
polarizability: 233.816583|22.8636727|206.5224322|-28.4474505|14.2548712|161.4895293 unknown
InChI: InChI=1S/C15H24N4O2/c1-5-6-7-8-9-10-11-16-13-12(17(11)2)14(20)19(4)15(21)18(13)3/h5-10H2,1-4H3
charge 0 multiplicity 1
45 atoms
O  -3.317498 1.479619 1.812117
O  -3.840464 -2.746749 -0.216893
N  -0.806553 1.793026 -0.036242
N  -0.199618 0.136749 -1.48911
N  -2.027885 -1.433928 -0.92579
N  -3.55333 -0.638985 0.770169
C  2.53386 2.04088 -0.529131
C  1.280151 2.202099 -1.443534
C  3.151445 0.626329 -0.574684
C  0.102563 1.381686 -1.008395
C  4.385931 0.481824 0.343472
C  -1.743543 0.754935 0.112825
C  -1.336298 -0.23894 -0.791245
C  5.015479 -0.928712 0.296211
C  -2.892508 0.625121 0.968626
C  6.245184 -1.082281 1.220256
C  -0.833543 3.080426 0.6818
C  -3.175946 -1.674168 -0.134983
C  -1.574252 -2.456896 -1.887126
C  6.866783 -2.494598 1.166727
C  -4.757255 -0.921394 1.585294
H  2.271052 2.296815 0.517828
H  3.290411 2.78341 -0.853275
H  1.540934 1.88517 -2.468717
H  0.994435 3.270923 -1.48846
H  3.438533 0.388878 -1.619886
H  2.387157 -0.123621 -0.291191
H  5.151277 1.233832 0.056746
H  4.095639 0.717218 1.389291
H  4.250223 -1.681594 0.578953
H  5.311244 -1.16483 -0.747473
H  5.94829 -0.846871 2.262885
H  7.009842 -0.329728 0.937875
H  -1.660312 3.046937 1.408231
H  0.118132 3.246782 1.213977
H  -1.005032 3.913662 -0.022388
H  -1.568945 -2.040076 -2.908109
H  -2.272416 -3.304074 -1.824403
H  -0.55155 -2.785168 -1.636523
H  7.200825 -2.742188 0.141306
H  6.132107 -3.2629 1.473695
H  7.742465 -2.57816 1.836511
H  -4.595395 -1.821777 2.200228
H  -5.623879 -1.103421 0.929126
H  -4.932437 -0.043565 2.224108
