program: Gaussian 09
title: 000225064
version: EM64L-G09RevD.01
frameworkgroup: C1[X(C14H20N4O4)]
method: RPBEPBE
basis: SDD
operation: Freq
keyword: #p
keyword: freq=noraman
keyword: PBEPBE/SDD
title: #p freq=noraman PBEPBE/SDD
converged: YES YES NO NO
title: Mulliken charges:
elementType: O O O O N N N N C C C C C C C C C C C C C C H H H H H H H H H H H H H H H H H H H H
charge: -0.269892 -0.267147 -0.417158 -0.229506 -0.414705 -0.163935 -0.069887 -0.219422 -0.390718 -0.368280 -0.527101 -0.354597 0.209402 -0.376929 0.118205 0.072582 0.119400 -0.487271 0.205756 -0.615441 -0.599393 0.173157 0.187036 0.219634 0.215486 0.201418 0.249605 0.232874 0.187710 0.189997 0.219412 0.220516 0.333784 0.253388 0.251121 0.272073 0.246140 0.247371 0.267560 0.250444 0.250595 0.376718
chargesum: 0.00000
title: Mulliken charges with hydrogens summed into heavy atoms:
elementType: O O O O N N N N C C C C C C C C C C C C C C
charge: -0.269892 -0.267147 -0.040441 -0.229506 -0.080921 -0.163935 -0.069887 -0.219422 0.015952 0.048624 -0.044622 0.023110 0.209402 0.062999 0.118205 0.072582 0.119400 0.017237 0.205756 0.150143 0.169204 0.173157
polarizability: 2.15386973e+02 4.00070999e+01 1.76952548e+02 -4.78713188e+00 -1.28311837e+00 1.89270433e+02
1716.lowfreq: -14.8392 -5.2571 -0.0005 -0.0003 0.0002 0.3831 6.8864 12.6548 16.1090
frequency: 0.4998 12.0730 16.0691 44.9598 54.6564 58.0169 77.7816 90.4790 105.2837 112.6722 122.5853 128.8531 130.6989 145.9799 178.0872 186.3587 208.4477 224.6994 279.7940 299.3042 323.3131 334.8160 349.9578 361.2610 371.4886 394.8982 420.8632 478.7007 482.2900 496.3964 501.0097 522.4491 588.7827 638.4324 639.3304 654.1928 674.8886 686.3845 695.6463 705.0029 724.0948 743.7179 758.8184 766.4009 827.9031 850.4279 866.7267 927.2155 932.2251 961.3279 972.1463 996.7107 1020.4099 1039.6854 1045.5271 1057.0673 1074.0677 1086.5552 1096.5851 1109.1689 1121.4662 1130.1610 1132.4135 1183.4752 1192.2121 1213.8940 1222.2433 1226.4476 1234.2452 1257.4253 1265.5235 1272.4538 1287.3037 1293.0531 1296.9734 1303.6529 1317.1178 1344.9162 1361.2825 1370.4461 1372.7571 1384.5360 1417.1666 1428.8377 1437.7759 1456.7143 1460.4560 1463.3689 1466.3341 1473.2952 1473.9102 1478.7362 1479.9585 1483.9502 1486.1603 1527.8258 1579.5550 1616.9405 1658.6178 1669.2412 2952.0416 2960.0941 2972.1103 2983.4043 2987.4103 2994.0063 2997.7693 3007.4280 3012.0408 3013.2579 3031.4406 3041.5637 3063.9794 3072.2336 3096.7685 3104.4481 3137.3460 3138.9991 3513.8593 3587.8343
redmass: 6.0436 8.6109 8.4527 4.2480 2.3112 2.9020 4.0021 1.0586 3.1364 2.9519 3.2267 1.7916 1.3608 3.1578 4.2019 4.8724 6.2277 2.8126 4.2524 3.3765 5.0041 3.9089 4.4851 3.5117 6.4202 6.3076 4.9663 4.2625 4.8670 5.4695 1.8531 4.7453 4.6606 1.3165 5.3376 2.6312 1.9740 2.9579 3.1305 9.1689 1.1216 11.2601 1.3909 4.9175 1.6480 2.4904 2.6587 2.9842 2.2624 2.6235 2.9025 4.1077 3.3565 3.1084 2.4822 2.0918 2.2824 2.1637 2.5706 3.2514 1.4186 1.3023 1.3002 1.6522 2.3569 1.7561 1.4140 2.7233 1.3733 1.4912 4.5360 1.2508 1.0979 1.2444 1.9859 1.9192 1.5143 1.5146 1.6132 3.7015 1.8292 3.4552 1.2940 1.3218 1.0848 1.2787 1.2813 1.0695 1.4336 1.0433 1.1065 1.0547 1.0723 1.3305 1.2059 4.1699 8.2964 10.5553 10.4036 8.2549 1.0591 1.0621 1.0600 1.0673 1.0614 1.0980 1.0597 1.0336 1.0328 1.0980 1.0991 1.1033 1.1031 1.0949 1.1025 1.1022 1.1025 1.1012 1.0639 1.0818
irintensity: 0.0899 0.6296 0.6773 0.1063 0.4039 0.1990 0.4026 0.0210 0.0716 4.0263 0.0883 0.0396 0.4171 1.6408 0.1460 20.5489 0.6494 7.3184 2.5211 0.5613 3.8985 3.4968 14.1501 13.2403 0.2835 20.6423 4.7535 28.5698 12.6485 5.9238 33.0098 4.1426 16.0863 127.8396 0.7273 29.4256 68.9077 16.0796 12.1186 6.3147 14.6832 10.1245 0.8625 0.6524 5.5904 1.0688 1.3219 3.3097 2.6534 27.6046 12.3763 49.5123 128.3054 29.7084 59.8617 14.1522 33.3247 25.0481 15.9355 20.2063 2.4204 0.3215 0.1439 15.5224 28.0567 51.3478 6.8268 5.5496 5.1365 12.6752 24.3889 6.3764 2.1628 5.3911 53.3019 50.8276 17.2156 21.6607 11.9340 28.5484 34.7677 33.3053 30.6030 66.4139 25.9819 52.3507 47.3131 0.4167 66.1569 18.1014 1.6701 10.3310 14.6897 71.4472 106.7678 42.0967 8.2998 563.0046 428.7836 207.1878 13.7629 13.9331 51.2854 31.0576 4.4024 7.6197 36.5146 34.3916 28.6933 5.0093 6.1290 60.4097 73.4863 20.2155 17.7715 17.4866 0.7497 0.4764 19.7735 61.8247
temp: 298.150 k
press: 1.00000 atm
elementType: 8 8 8 8 7 7 7 7 6 6 6 6 6 6 6 6 6 6 6 6 6 6 1 1 1 1 1 1 1 1 1 1 1 1 1 1 1 1 1 1 1 1
symmnumber: 1
zpe: 886223.9 jmol-1
zpe.correction: 0.337545 hartree
zpe.thermalcorrener: 0.360436 hartree
zpe.thermalcorrenthalpy: 0.361380 hartree
zpe.thermalcorrgfe: 0.277388 hartree
zpe.sumelectzpe: -1063.791560 hartree
zpe.sumelectthermal: -1063.768669 hartree
zpe.sumelectthermalent: -1063.767725 hartree
zpe.sumelectthermalfe: -1063.851717 hartree
dipole: 3.8098 3.8895 -0.9461
dipole: 5.5261
quadrupole: -136.2072 -124.8908 -139.8356
quadrupole: -3.0571 -6.2158 2.3346
quadrupole: -2.5627 8.7537 -6.1911 -3.0571 -6.2158 2.3346
hfenergy: -1064.1291051 hartree
pointgroup: C01 [X(C14H20N4O4)]
dipole: 1.4259044 -1.6347071 -0.1465072 debye
polarizability: 212.4932518|-40.083389|183.9462916|-9.4161128|-7.3799596|185.1704101 unknown
InChI: InChI=1S/C14H20N4O4/c1-17-12-11(13(21)18(2)14(17)22)15-9(16-12)7-5-3-4-6-8-10(19)20/h15,19H,3-8H2,1-2H3
charge 0 multiplicity 1
42 atoms
O  -3.171966 -0.546603 2.572884
O  -4.672326 2.574996 -0.64072
O  7.626549 1.101384 1.761184
O  6.302004 2.135379 0.159561
N  -1.343493 -1.628914 0.303103
N  -3.042613 1.028578 -1.321897
N  -1.33228 -0.714307 -1.776886
N  -3.91252 1.015942 0.937546
C  1.518937 -2.680151 -0.526112
C  2.31067 -1.355836 -0.602782
C  0.232764 -2.686017 -1.398067
C  3.588343 -1.375802 0.264879
C  -0.798675 -1.681005 -0.974599
C  4.40471 -0.069019 0.155991
C  -2.271675 -0.582607 0.329287
C  -2.240723 -0.043858 -0.964157
C  -3.111464 -0.093524 1.387705
C  5.67199 -0.101476 1.03058
C  -3.91898 1.598482 -0.364737
C  -2.994932 1.579135 -2.690072
C  -4.837406 1.637627 1.912982
C  6.512531 1.154323 0.905022
H  1.26274 -2.898804 0.532079
H  2.165646 -3.514655 -0.862263
H  1.66271 -0.513014 -0.287811
H  2.584217 -1.156487 -1.659006
H  0.488294 -2.457344 -2.447053
H  -0.211687 -3.701761 -1.387485
H  4.222893 -2.235323 -0.038225
H  3.308058 -1.553609 1.324591
H  3.776409 0.793337 0.450476
H  4.69131 0.109449 -0.897925
H  -1.125735 -2.230714 1.096929
H  5.419269 -0.237113 2.100242
H  6.315433 -0.964165 0.765903
H  -3.693907 2.426888 -2.731612
H  -3.289675 0.806817 -3.420336
H  -1.971518 1.915051 -2.92617
H  -4.722662 1.095304 2.862977
H  -5.875553 1.56641 1.549502
H  -4.589863 2.703801 2.04262
H  8.159976 1.935409 1.652673
