program: Gaussian 09
title: 000225062
version: EM64L-G09RevD.01
frameworkgroup: C1[X(C14H16O4)]
method: RPBEPBE
basis: SDD
operation: Freq
keyword: #pfreq=noraman
keyword: PBEPBE/SDD
title: #p freq=noraman PBEPBE/SDD
converged: YES YES NO NO
title: Mulliken charges:
elementType: O O O O C C C C C C C C C C C C C C H H H H H H H H H H H H H H H H
charge: -0.282116 -0.269462 -0.441576 -0.244812 0.231794 0.180954 0.203444 -0.226445 -0.716336 -0.692761 -0.303602 0.135460 0.009202 -0.648212 0.261041 0.129096 -0.732441 -0.526889 0.231227 0.231842 0.239245 0.205253 0.243918 0.227589 0.217557 0.271450 0.246505 0.258208 0.234237 0.234414 0.366145 0.226983 0.283354 0.215731
chargesum: 0.00000
title: Mulliken charges with hydrogens summed into heavy atoms:
elementType: O O O O C C C C C C C C C C C C C C
charge: -0.282116 -0.269462 -0.075431 -0.244812 0.231794 0.180954 0.203444 0.004782 -0.039996 -0.003697 -0.032152 0.135460 0.009202 -0.401707 0.261041 0.129096 -0.005581 0.199180
polarizability: 2.65807439e+02 4.20689578e+00 1.76475176e+02 -2.25580205e+00 2.35061599e+00 9.98906122e+01
1716.lowfreq: -9.2335 -0.0007 0.0003 0.0006 5.6685 9.1443 41.5992 53.3590 80.1768
frequency: 41.5890 53.3380 80.1746 84.9125 122.4169 158.2008 168.6903 192.0320 197.1974 212.3430 226.4669 232.5818 241.4223 262.6262 269.7495 294.3094 305.8129 327.6714 351.4876 367.6592 383.4546 410.5539 425.9984 436.5729 494.7592 518.0194 546.8387 555.2067 576.8181 595.4483 613.3764 629.3581 672.3922 716.8441 732.0368 776.5481 796.2751 810.0842 846.9418 862.0972 903.6040 919.0596 947.0133 970.7417 982.3987 996.5981 1018.2027 1036.8351 1081.0969 1107.0269 1111.8208 1138.5399 1152.1860 1169.3105 1179.1808 1215.1851 1220.2174 1243.2186 1273.0535 1312.4732 1352.7327 1372.1191 1373.4036 1378.4090 1392.3748 1412.3140 1437.5289 1443.5828 1447.2415 1451.3689 1454.1989 1458.9323 1463.7944 1469.7608 1474.9362 1482.1714 1560.8436 1576.7998 1600.1873 1639.8121 2978.7107 2984.7450 2994.7509 2998.5478 3084.5427 3089.8465 3093.2283 3094.0328 3095.1512 3105.1598 3117.3794 3118.5285 3135.0608 3143.3152 3176.3832 3574.3546
redmass: 3.8600 3.4218 4.6234 4.8753 3.3104 2.9312 1.2147 1.0292 3.5412 2.6594 2.1572 3.2795 1.4736 2.6270 2.4315 2.9453 2.9460 3.2080 3.3220 1.3221 2.7171 3.3549 5.1337 5.1693 4.9194 5.0526 3.5390 4.5397 4.5025 4.1482 5.1503 3.5578 3.9835 5.9294 2.1542 2.6988 4.4013 2.0673 4.5097 3.1406 4.8226 1.5819 1.8439 1.3018 2.0141 1.3102 1.8982 4.0090 3.5099 1.5807 1.2783 2.7303 1.3716 1.7016 1.7301 1.7524 2.5890 2.3923 4.6165 4.8094 2.5090 1.2469 1.3187 3.9910 1.2849 2.6701 1.1255 1.2205 1.1409 1.0550 1.1191 1.0620 1.9909 1.2619 1.1590 1.0810 6.2178 7.6835 8.6489 7.7270 1.0316 1.0346 1.0355 1.0350 1.0996 1.1002 1.0962 1.1009 1.0995 1.1008 1.1027 1.1055 1.0880 1.0921 1.0970 1.0658
irintensity: 0.7419 2.9093 1.2595 3.2264 9.2002 3.0711 0.3570 0.0139 2.9991 0.8224 0.9770 3.7582 0.4045 4.0220 1.7796 3.2594 5.0380 0.3292 10.2194 103.9335 14.5975 2.3725 9.3069 9.0005 1.7877 7.2812 4.4832 11.7466 3.9907 18.1733 3.0595 30.8871 13.4948 2.6044 20.3505 20.2811 4.8681 42.5605 42.1394 8.8474 8.4147 1.7300 3.0660 3.1368 11.2600 0.3746 12.9607 95.9679 126.0426 119.7589 17.9114 278.8380 19.1416 16.8924 101.4783 13.0956 32.9663 119.9262 86.9990 31.2703 77.2319 35.5157 38.8794 65.8712 32.0472 42.8753 47.5108 42.6508 8.8428 7.2012 13.6366 1.9675 3.6155 8.8156 45.0413 15.0834 185.4341 211.4721 306.5051 89.0772 56.9580 15.7393 25.4560 5.0740 7.0083 30.0992 10.9619 21.3985 27.2977 29.3271 18.3809 13.9293 4.1513 4.8770 11.8110 49.6194
temp: 298.150 k
press: 1.00000 atm
elementType: 8 8 8 8 6 6 6 6 6 6 6 6 6 6 6 6 6 6 1 1 1 1 1 1 1 1 1 1 1 1 1 1 1 1
symmnumber: 1
zpe: 703370.2 jmol-1
zpe.correction: 0.267900 hartree
zpe.thermalcorrener: 0.285961 hartree
zpe.thermalcorrenthalpy: 0.286905 hartree
zpe.thermalcorrgfe: 0.223168 hartree
zpe.sumelectzpe: -842.615456 hartree
zpe.sumelectthermal: -842.597394 hartree
zpe.sumelectthermalent: -842.596450 hartree
zpe.sumelectthermalfe: -842.660187 hartree
dipole: 2.4364 -1.6348 -2.0553
dipole: 3.5823
quadrupole: -99.8875 -91.9134 -110.6552
quadrupole: 4.5974 10.5566 -5.0679
quadrupole: 0.9312 8.9053 -9.8365 4.5974 10.5566 -5.0679
hfenergy: -842.8833551 hartree
pointgroup: C01 [X(C14H16O4)]
dipole: -0.8746208 -0.5208627 0.9747449 debye
polarizability: 265.4713749|0.2027312|172.0651776|-9.3782586|-17.6853772|104.6366747 unknown
InChI: InChI=1S/C14H16O4/c1-8(15)12-10(16)7-11-9(13(12)17-4)5-6-14(2,3)18-11/h5-7,16H,1-4H3
charge 0 multiplicity 1
34 atoms
O  -2.446476 -1.006547 0.694295
O  0.834652 2.299835 -0.442018
O  2.17896 -2.340022 0.597587
O  3.268621 0.909737 -1.510255
C  -3.546731 -0.138915 0.094454
C  -0.759483 0.658809 0.053842
C  -1.124614 -0.662315 0.430746
C  -3.122084 1.321796 0.106034
C  -4.758544 -0.408707 0.998606
C  -3.775305 -0.643187 -1.349491
C  -1.808532 1.678935 0.032955
C  0.62073 0.955802 -0.15025
C  1.643699 -0.048671 -0.017588
C  -0.148707 -1.650905 0.659927
C  1.205271 -1.336443 0.439772
C  3.045216 0.154351 -0.511732
C  4.218081 -0.540005 0.170874
C  2.078833 3.004047 -0.098804
H  -3.920613 2.071726 0.13508
H  -4.991252 -1.487316 1.014545
H  -4.554564 -0.076696 2.030303
H  -5.642026 0.135668 0.619328
H  -2.862062 -0.511055 -1.955151
H  -4.053289 -1.712297 -1.344017
H  -4.58819 -0.067403 -1.828187
H  -1.499601 2.725875 -0.020824
H  -0.464442 -2.650205 0.979322
H  4.361148 -1.545907 -0.262136
H  4.054882 -0.679903 1.251667
H  5.126659 0.056326 -0.017111
H  1.747481 -3.194111 0.849875
H  1.768483 4.044228 0.090163
H  2.788531 2.943445 -0.93831
H  2.541065 2.574129 0.810002
