program: Gaussian 09
title: 000225060
version: EM64L-G09RevD.01
frameworkgroup: C1[X(C14H15N5O2)]
method: RPBEPBE
basis: SDD
operation: Freq
keyword: #p
keyword: freq=noraman
keyword: PBEPBE/SDD
title: #p freq=noraman PBEPBE/SDD
converged: YES YES NO NO
title: Mulliken charges:
elementType: O O N N N N N C C C C C C C C C C C C C C H H H H H H H H H H H H H H H
charge: -0.302750 -0.276469 -0.238632 -0.157861 -0.221138 -0.107431 -0.608284 0.164185 0.096930 -0.570480 0.154340 0.170497 0.201951 0.461603 -0.616843 -0.603452 -0.350993 -0.461706 -0.224302 -0.218078 -0.238180 0.240597 0.299350 0.271132 0.244622 0.244101 0.267866 0.247272 0.247257 0.252892 0.244561 0.352016 0.335200 0.232947 0.232840 0.234440
chargesum: 0.00000
title: Mulliken charges with hydrogens summed into heavy atoms:
elementType: O O N N N N N C C C C C C C C C C C C C C
charge: -0.302750 -0.276469 -0.238632 -0.157861 -0.221138 -0.107431 0.078932 0.164185 0.096930 -0.030532 0.154340 0.170497 0.201951 0.461603 0.143012 0.158943 -0.098101 -0.217145 0.008645 0.014762 -0.003740
polarizability: 2.70311819e+02 1.47971602e+01 1.75212888e+02 -1.26687865e+01 7.51260980e-01 1.35986068e+02
1716.lowfreq: -5.2851 -0.0002 0.0005 0.0006 1.7270 9.0944 24.8412 32.2071 43.5822
frequency: 24.8344 32.1564 43.5785 76.0237 86.8061 95.2509 116.6897 128.3206 132.9919 156.3170 213.9691 232.5608 241.5918 251.2431 302.7629 312.8137 318.9050 357.0024 370.4498 384.8388 401.9048 409.2866 413.5014 440.0938 478.1097 490.3390 497.2661 520.4465 575.3158 615.4539 643.5807 686.5609 698.4461 701.5183 704.4268 719.0606 729.2613 754.6428 764.9284 799.4118 818.2133 859.9275 917.6301 947.6531 957.1923 983.3399 989.9784 996.0933 1002.9921 1026.2802 1035.7405 1045.3577 1085.1400 1100.9261 1129.8107 1132.5704 1174.5468 1187.0067 1189.3154 1210.8679 1224.5600 1227.4915 1258.0413 1268.7826 1296.7081 1328.1505 1356.0504 1382.4891 1385.8507 1410.3717 1426.6612 1436.5483 1446.9431 1464.4110 1473.9538 1477.3458 1477.9938 1479.0960 1487.7210 1500.8889 1543.9804 1582.2469 1594.0621 1609.6470 1613.8843 1644.6149 1651.1238 2980.1734 3005.9947 3009.4053 3037.6432 3094.4011 3100.5655 3115.4943 3128.6599 3135.0842 3137.9331 3139.5328 3150.7901 3167.4644 3534.0501 3686.1410
redmass: 5.3210 3.9846 5.2277 1.0787 3.5717 4.6061 1.2890 3.8807 3.6012 4.7794 4.3450 4.3625 6.7256 4.2886 2.8976 3.3095 3.9565 4.1733 6.6699 8.8588 2.6165 2.9858 1.6332 2.6566 3.3629 1.6735 2.6400 7.6030 5.6698 6.3118 9.8826 5.1547 10.4694 6.5152 3.5074 2.2743 10.8358 2.9763 3.8573 3.4985 4.4299 1.2453 1.4450 2.1430 5.2991 1.3923 5.9877 1.9918 1.4641 2.2180 2.3613 2.8174 1.7077 2.3617 1.3011 1.2978 1.0573 3.5729 1.1277 3.1068 4.0931 2.7751 1.7019 4.8658 3.4608 1.4264 1.7328 3.7378 4.7325 1.3640 1.3670 2.3134 2.2104 1.5979 1.0457 1.3147 1.0428 1.1862 1.6330 2.1477 4.1694 2.3898 5.9546 4.1881 5.4738 3.1047 9.4115 1.0598 1.0336 1.0327 1.1042 1.1024 1.1021 1.0882 1.0862 1.1023 1.1011 1.0911 1.0960 1.1015 1.0465 1.1033
irintensity: 0.1750 0.1076 0.9209 0.0689 0.7376 0.3417 0.6371 1.8709 12.6242 4.0198 5.5588 3.9610 3.5127 2.6786 1.4656 3.3365 0.8862 10.8833 1.1737 16.8242 2.2754 18.1983 19.7947 6.2642 20.9624 200.5640 83.8222 4.0049 2.3732 0.5232 7.0036 1.1794 3.8307 10.2610 24.2602 66.4868 20.7672 24.0287 3.5631 7.7405 1.3603 0.5230 5.1671 0.4439 57.6097 0.3911 0.2683 33.6271 8.0343 11.4920 0.6852 38.3745 18.5284 6.6835 0.3070 0.1616 0.1709 37.5732 1.2370 64.1898 20.5679 1.5227 24.6319 49.0980 26.0070 5.4099 44.0283 10.6645 34.8180 8.0302 80.5243 180.6141 68.8559 72.6081 15.6772 35.8475 16.3281 6.8276 98.8401 127.3755 181.7985 57.2099 2.0285 631.2466 21.5466 371.4484 324.3014 44.9073 39.4006 34.1884 27.0208 18.8825 19.0984 7.9029 1.2783 0.6768 0.5389 9.0710 30.6243 21.2812 130.1796 88.5116
temp: 298.150 k
press: 1.00000 atm
elementType: 8 8 7 7 7 7 7 6 6 6 6 6 6 6 6 6 6 6 6 6 6 1 1 1 1 1 1 1 1 1 1 1 1 1 1 1
symmnumber: 1
zpe: 736817.1 jmol-1
zpe.correction: 0.280639 hartree
zpe.thermalcorrener: 0.299672 hartree
zpe.thermalcorrenthalpy: 0.300616 hartree
zpe.thermalcorrgfe: 0.232275 hartree
zpe.sumelectzpe: -965.242693 hartree
zpe.sumelectthermal: -965.223660 hartree
zpe.sumelectthermalent: -965.222716 hartree
zpe.sumelectthermalfe: -965.291057 hartree
dipole: 6.0608 2.9419 -0.2601
dipole: 6.7421
quadrupole: -119.4354 -123.9672 -116.7441
quadrupole: 4.0261 1.0606 -2.7036
quadrupole: 0.6135 -3.9183 3.3048 4.0261 1.0606 -2.7036
hfenergy: -965.5233319 hartree
pointgroup: C01 [X(C14H15N5O2)]
dipole: -2.2681195 1.3090597 -0.4218311 debye
polarizability: 266.9875498|-25.8991472|173.226824|-2.2863399|-14.3829714|141.2964021 unknown
InChI: InChI=1S/C14H15N5O2/c1-17-11-10(12(20)18(2)14(17)21)19(13(15)16-11)8-9-6-4-3-5-7-9/h3-7H,8,15H2,1-2H3
charge 0 multiplicity 1
36 atoms
O  0.754578 -2.173836 1.549148
O  4.879335 -0.802623 -0.299085
N  -0.363938 0.546306 0.481875
N  3.052666 0.653304 -0.540904
N  2.820993 -1.453959 0.615698
N  0.989502 2.007684 -0.668013
N  -1.318967 2.639206 -0.307689
C  0.926176 -0.037251 0.419089
C  1.712237 0.889582 -0.281522
C  -1.524475 0.016134 1.228958
C  -0.267591 1.763733 -0.182576
C  1.417074 -1.284377 0.915277
C  3.657745 -0.546915 -0.088224
C  -2.781128 -0.112775 0.372979
C  3.857258 1.640859 -1.284478
C  3.477072 -2.697695 1.077563
C  -2.73894 -0.787473 -0.874499
C  -4.014383 0.415889 0.828664
C  -3.910563 -0.932222 -1.64754
C  -5.190833 0.267653 0.056507
C  -5.140636 -0.40541 -1.184823
H  -1.723691 0.668124 2.101907
H  -1.204569 -0.972269 1.609494
H  4.879125 1.242625 -1.364793
H  3.863464 2.604642 -0.748242
H  3.428714 1.799785 -2.288344
H  2.710506 -3.299103 1.588026
H  4.303584 -2.457442 1.766469
H  3.893946 -3.248509 0.218462
H  -1.788203 -1.199275 -1.232641
H  -4.058963 0.932236 1.7962
H  -2.279063 2.324201 -0.178593
H  -1.138337 3.507776 -0.804562
H  -3.868297 -1.458296 -2.607649
H  -6.139292 0.675847 0.422755
H  -6.049305 -0.521058 -1.785694
