program: Gaussian 09
title: 000225058
version: EM64L-G09RevD.01
frameworkgroup: C1[X(C13H11Cl2N5O2)]
method: RPBEPBE
basis: SDD
operation: Freq
keyword: #p
keyword: freq=noraman
keyword: PBEPBE/SDD
title: #p freq=noraman PBEPBE/SDD
converged: YES YES NO NO
title: Mulliken charges:
elementType: Cl Cl O O N N N N N C C C C C C C C C C C C C H H H H H H H H H H H
charge: -0.061058 -0.048170 -0.271617 -0.264413 -0.168578 -0.218216 -0.451045 -0.149574 -0.424226 0.131116 0.138124 0.132027 0.201357 0.212492 -0.616761 -0.598398 0.646435 -0.427914 -0.230521 -0.128317 -0.201619 -0.266446 0.337789 0.275896 0.246449 0.246529 0.314192 0.268404 0.250393 0.250930 0.348659 0.260940 0.265139
chargesum: 0.00000
title: Mulliken charges with hydrogens summed into heavy atoms:
elementType: Cl Cl O O N N N N N C C C C C C C C C C C C C
charge: -0.061058 -0.048170 -0.271617 -0.264413 -0.168578 -0.218216 -0.113256 -0.149574 -0.110034 0.131116 0.138124 0.132027 0.201357 0.212492 0.152113 0.171329 0.646435 -0.427914 0.118139 -0.128317 0.059322 -0.001307
polarizability: 3.42500116e+02 9.58145092e+00 2.46423266e+02 2.06263799e-01 9.20174742e-02 8.37312646e+01
1716.lowfreq: -1.9497 -0.8847 0.0016 0.0019 0.0019 5.0868 21.9365 36.9848 51.8443
frequency: 21.9227 36.9829 51.8384 85.0559 92.9083 95.6147 101.9428 118.2367 129.4906 139.0269 156.0267 183.0285 209.2102 248.6401 253.3058 293.1100 300.5152 308.6597 325.0813 338.7511 361.3623 366.0264 389.5383 398.4125 441.9686 458.8977 483.2414 503.0002 538.1038 539.8919 581.2411 614.4692 634.2783 639.8599 659.3158 690.5715 702.9226 713.0201 713.1772 734.5622 763.7145 791.0315 809.4732 894.3694 920.0136 927.8937 931.6245 964.8009 996.5981 1014.1617 1039.2661 1081.8958 1104.9577 1129.5489 1131.4655 1133.0269 1192.6841 1214.2764 1226.9272 1235.1301 1262.0491 1274.1509 1288.8814 1341.3453 1379.7241 1385.8865 1413.5980 1418.2300 1431.1863 1455.6531 1467.8975 1472.0084 1478.6150 1481.0662 1492.5601 1532.8003 1556.5466 1579.8278 1602.5114 1611.6138 1637.2475 1661.9169 3006.2463 3011.6093 3095.6779 3103.9626 3136.9427 3138.7384 3168.9794 3171.2528 3189.7385 3488.1618 3586.1300
redmass: 7.2461 6.0788 9.9014 3.6131 1.7274 1.9389 1.2954 3.2852 6.6228 8.8740 16.6386 4.5759 6.3045 8.6784 5.8066 2.9748 6.4865 27.0148 5.7650 3.6707 6.3526 8.2013 7.1511 6.3137 3.0529 7.4918 8.9317 9.5223 1.5219 6.5578 2.6250 7.7402 1.2762 9.9147 6.4928 8.3785 11.1076 4.5127 6.7534 11.0377 5.0124 1.3253 7.4731 6.3655 1.3532 4.5723 1.3460 3.3445 6.7313 5.7053 3.0932 1.9423 3.7916 1.3001 1.3010 1.4047 2.5997 2.1783 2.6443 1.9192 5.5539 2.3475 2.5207 2.9477 7.1830 4.8355 2.1111 1.8179 1.3554 2.6688 1.6321 1.0479 1.0691 1.0423 1.7838 2.8940 6.3725 4.3683 7.9051 6.5564 7.3397 10.1696 1.0338 1.0326 1.1027 1.1022 1.1025 1.1008 1.0896 1.0931 1.0976 1.0759 1.0819
irintensity: 0.0096 0.0640 0.2418 0.1489 0.0748 0.2712 0.9779 3.2320 0.8925 4.6267 1.0960 18.5303 0.2990 9.5814 1.5656 1.9914 1.0613 0.0068 1.5098 7.7364 0.3216 16.3765 2.1188 9.8237 15.4209 16.5769 20.6780 35.4414 4.2040 0.5521 5.4003 0.0339 176.3051 24.0056 0.9869 0.2492 4.3818 6.5550 9.7244 18.4802 0.4705 47.7830 3.4371 69.0683 20.0800 3.9904 11.2035 46.1227 49.3070 39.9749 34.1542 45.2386 21.6777 0.3705 0.0667 7.1719 44.5042 102.1896 2.4445 14.3625 28.5358 10.3136 61.2291 38.0960 12.3360 5.0870 46.0202 1.0168 58.1917 95.0227 156.4047 19.3481 6.7612 18.3756 394.3579 98.8525 570.2164 53.3400 366.6409 629.8510 497.1621 461.5392 28.4596 32.7958 17.6002 17.4096 0.8155 0.4705 1.3021 44.0132 0.4562 101.9618 92.4116
temp: 298.150 k
press: 1.00000 atm
elementType: 17 17 8 8 7 7 7 7 7 6 6 6 6 6 6 6 6 6 6 6 6 6 1 1 1 1 1 1 1 1 1 1 1
symmnumber: 1
zpe: 612959.5 jmol-1
zpe.correction: 0.233464 hartree
zpe.thermalcorrener: 0.253565 hartree
zpe.thermalcorrenthalpy: 0.254509 hartree
zpe.thermalcorrgfe: 0.183231 hartree
zpe.sumelectzpe: -1844.797851 hartree
zpe.sumelectthermal: -1844.777750 hartree
zpe.sumelectthermalent: -1844.776806 hartree
zpe.sumelectthermalfe: -1844.848084 hartree
dipole: 3.9356 -1.9390 0.0009
dipole: 4.3874
quadrupole: -148.7204 -146.1638 -142.9877
quadrupole: -4.3815 -0.0072 0.0053
quadrupole: -2.7631 -0.2065 2.9696 -4.3815 -0.0072 0.0053
hfenergy: -1845.031315 hartree
pointgroup: C01 [X(C13H11Cl2N5O2)]
dipole: -1.5517129 -0.7549581 -0.0412985 debye
polarizability: 342.3851669|-9.7790553|245.5483278|-3.4147362|12.4810389|84.7211523 unknown
InChI: InChI=1S/C13H11Cl2N5O2/c1-19-10-9(11(21)20(2)13(19)22)17-12(18-10)16-8-5-6(14)3-4-7(8)15/h3-5,16-17H,1-2H3
charge 0 multiplicity 1
33 atoms
Cl -4.056195 -3.052429 -0.181292
Cl -4.006861 3.351055 0.332098
O  3.764378 -2.570675 -0.206836
O  4.653373 2.060915 0.117851
N  2.402539 1.393608 0.090516
N  4.192295 -0.232186 -0.043345
N  0.772138 -1.757233 -0.11854
N  0.122485 0.42812 0.044078
N  -1.60286 -1.316541 -0.06425
C  1.947016 -0.985521 -0.075664
C  1.509545 0.339232 0.023991
C  3.323436 -1.382083 -0.118239
C  -0.295426 -0.867886 -0.044686
C  3.799331 1.131895 0.058657
C  1.923858 2.785807 0.194611
C  5.653508 -0.471795 -0.073927
C  -2.78346 -0.551211 0.007258
C  -4.039012 -1.22194 -0.034501
C  -2.790723 0.866372 0.121186
C  -4.02295 1.535529 0.187059
C  -5.259647 -0.537092 0.032627
C  -5.264616 0.872496 0.146058
H  0.758718 -2.774416 -0.188146
H  2.808455 3.437704 0.233787
H  1.319114 2.912346 1.108322
H  1.303673 3.040878 -0.681116
H  -1.754367 -2.326982 -0.143231
H  5.80376 -1.557117 -0.170291
H  6.118874 -0.098088 0.852863
H  6.106225 0.060001 -0.926494
H  -1.836131 1.395538 0.153641
H  -6.200981 -1.091948 -0.002661
H  -6.20509 1.425544 0.199619
