program: Gaussian 09
title: 000225052
version: EM64L-G09RevD.01
frameworkgroup: C1[X(C11H16N6O2)]
method: RPBEPBE
basis: SDD
operation: Freq
keyword: #p
keyword: freq=noraman
keyword: PBEPBE/SDD
title: #p freq=noraman PBEPBE/SDD
converged: NO YES NO NO
title: Mulliken charges:
elementType: O O N N N N N N C C C C C C C C C C C H H H H H H H H H H H H H H H H
charge: -0.291395 -0.270628 -0.319853 -0.329592 -0.150851 -0.150654 -0.223037 -0.100375 -0.144317 -0.429351 -0.449781 -0.393041 0.129422 0.076743 -0.186287 0.185256 0.209904 -0.612065 -0.601616 0.258090 0.270068 0.238225 0.241313 0.222260 0.216719 0.217263 0.284121 0.276806 0.295241 0.269327 0.247541 0.247023 0.267254 0.250119 0.250151
chargesum: 0.00000
title: Mulliken charges with hydrogens summed into heavy atoms:
elementType: O O N N N N N N C C C C C C C C C C C
charge: -0.291395 -0.270628 -0.035732 -0.052786 -0.150851 -0.150654 -0.223037 -0.100375 0.113773 0.078942 0.013793 0.040940 0.129422 0.076743 0.108954 0.185256 0.209904 0.151825 0.165908
polarizability: 2.31460454e+02 1.96122190e+00 1.74835760e+02 1.13020527e+01 -2.03778966e+00 9.83679702e+01
1716.lowfreq: -8.5455 -0.0007 -0.0005 -0.0004 5.5009 9.4498 30.0088 46.9881 55.9508
frequency: 29.7636 46.8965 55.9196 69.2028 89.9276 95.6758 115.2768 119.0490 145.1391 157.9808 171.0611 235.4809 250.2365 278.7058 292.5662 304.6166 347.6749 373.7918 382.8808 388.0401 402.0963 433.3866 466.9138 487.3006 546.4793 613.8413 626.1872 643.1288 669.7739 697.9302 704.0839 735.1557 744.4320 768.7935 789.1890 825.5367 846.1407 884.6113 909.7056 917.5177 958.3068 964.9998 981.1182 1011.6718 1026.1733 1049.4795 1068.0889 1106.3861 1129.9589 1131.7593 1139.8489 1156.8914 1165.6302 1181.2335 1201.4858 1211.3974 1224.3672 1238.6653 1263.3167 1268.2857 1298.4024 1302.8363 1312.0368 1323.6531 1351.5752 1356.8681 1377.3035 1402.8763 1412.3588 1424.1911 1426.4425 1433.6010 1462.1845 1472.5610 1474.1346 1476.0059 1477.8748 1479.3207 1493.9044 1502.5894 1568.7774 1612.8134 1645.6288 2965.4142 2990.4213 3001.1665 3007.7942 3011.8497 3012.5882 3035.8638 3080.0194 3088.2935 3097.0937 3104.0814 3138.8786 3139.9034 3260.4486 3451.8017 3519.9120
redmass: 5.0176 3.5060 4.3992 2.8300 2.1602 1.3488 2.2694 1.4903 3.6664 3.8155 4.1536 2.2427 2.6850 3.8209 5.0446 3.4219 3.6067 6.1969 7.0323 2.4029 5.5485 7.8107 2.3663 5.4232 6.0637 4.6741 2.0622 5.2660 8.3350 2.1648 10.7519 4.4866 10.1170 2.9813 3.9386 1.4661 2.5191 1.6933 3.8911 2.7310 5.8375 2.5227 2.7792 2.9724 2.0041 3.1452 2.6104 3.4886 1.2999 1.3040 2.5303 2.2436 2.0122 1.4058 1.5382 1.8628 3.1134 2.0480 1.7948 2.1523 6.5331 1.5211 1.2111 1.5229 1.4687 2.4062 1.6604 1.7314 1.3843 1.4926 1.3227 1.3931 1.3963 1.1513 1.0441 1.1543 1.0429 1.0897 1.0840 2.4538 8.1016 10.6665 9.6431 1.0645 1.0850 1.0673 1.0335 1.0585 1.0354 1.0977 1.1065 1.1026 1.1025 1.1021 1.1023 1.1013 1.0992 1.0759 1.0772
irintensity: 0.0754 0.3590 1.6604 2.2786 0.0520 0.0227 4.9561 2.4053 5.7969 2.3562 4.1318 10.6423 15.1180 3.4096 0.9725 2.1482 6.9640 15.9746 16.9265 94.4307 20.9332 19.0941 38.5361 12.8859 1.0282 17.3029 7.5193 4.4325 0.5225 93.4595 9.8771 5.7558 11.6219 14.9053 9.4253 19.7858 1.3726 2.3821 2.2450 2.1724 31.9599 11.3402 16.8485 61.3402 2.4332 9.8153 26.3803 56.9055 0.4356 0.0580 49.2633 42.0490 17.7193 31.4069 15.7952 52.3110 6.7592 40.4962 6.8078 21.2537 18.0349 21.3904 12.1762 22.3011 3.2131 10.9390 22.3812 80.4463 15.9923 116.9204 75.1569 14.1684 56.6053 11.4666 18.6578 40.7452 15.8062 3.0392 2.1814 133.0827 4.5333 656.2762 346.5347 121.1310 22.4174 25.3544 38.7330 81.5430 16.3038 50.3313 2.9436 40.3860 17.7415 17.6106 0.8091 0.5718 5.2908 1.1041 2.8914
temp: 298.150 k
press: 1.00000 atm
elementType: 8 8 7 7 7 7 7 7 6 6 6 6 6 6 6 6 6 6 6 1 1 1 1 1 1 1 1 1 1 1 1 1 1 1 1
symmnumber: 1
zpe: 736508.6 jmol-1
zpe.correction: 0.280521 hartree
zpe.thermalcorrener: 0.298466 hartree
zpe.thermalcorrenthalpy: 0.299410 hartree
zpe.thermalcorrgfe: 0.233544 hartree
zpe.sumelectzpe: -906.320067 hartree
zpe.sumelectthermal: -906.302123 hartree
zpe.sumelectthermalent: -906.301179 hartree
zpe.sumelectthermalfe: -906.367044 hartree
dipole: -5.4501 -1.0130 -0.5677
dipole: 5.5725
quadrupole: -105.0575 -117.1285 -109.9089
quadrupole: 1.5163 1.6360 -3.2523
quadrupole: 5.6408 -6.4302 0.7894 1.5163 1.6360 -3.2523
hfenergy: -906.6005886 hartree
pointgroup: C01 [X(C11H16N6O2)]
dipole: 2.1293239 -0.5170043 0.0721375 debye
polarizability: 231.7296923|-5.6901609|172.3926034|6.4329025|14.4076601|100.5418883 unknown
InChI: InChI=1S/C11H16N6O2/c1-15-9-8(10(18)16(2)11(15)19)17(6-14-9)5-7-12-3-4-13-7/h6-7,12-13H,3-5H2,1-2H3
charge 0 multiplicity 1
35 atoms
O  -0.440929 2.380273 0.730562
O  -4.645782 0.468492 -0.226203
N  3.504561 -1.011355 -0.889551
N  3.988727 1.263484 -0.436144
N  0.699731 -0.50915 0.333815
N  -2.788542 -0.967108 -0.237653
N  -2.539974 1.388465 0.241622
N  -0.678572 -2.264091 -0.179269
C  2.864437 0.309156 -0.651508
C  1.929998 0.265352 0.59185
C  4.830738 -0.959349 -0.199769
C  5.277442 0.528343 -0.330277
C  -0.604317 0.009561 0.239666
C  -1.417137 -1.093327 -0.072717
C  0.600316 -1.866208 0.071279
C  -1.11504 1.341618 0.43184
C  -3.401063 0.298373 -0.086698
C  -3.612575 -2.145395 -0.570328
C  -3.214208 2.697454 0.401265
H  2.253543 0.577287 -1.535374
H  1.61106 1.286901 0.864162
H  2.477379 -0.184041 1.439981
H  5.531708 -1.674367 -0.660407
H  4.705579 -1.234751 0.863762
H  5.869756 0.865283 0.541127
H  5.895592 0.671801 -1.238906
H  3.607962 -1.199974 -1.895783
H  3.82555 2.006626 0.24894
H  1.475921 -2.5081 0.046589
H  -4.654713 -1.80711 -0.662482
H  -3.525746 -2.904345 0.225101
H  -3.268519 -2.590114 -1.518962
H  -2.438802 3.436654 0.649517
H  -3.966209 2.639998 1.205075
H  -3.72907 2.973967 -0.53322
