program: Gaussian 09
title: 000225049
version: EM64L-G09RevD.01
frameworkgroup: C1[X(C10H20O3)]
method: RPBEPBE
basis: SDD
operation: Freq
keyword: #pfreq=noraman
keyword: PBEPBE/SDD
title: #p freq=noraman PBEPBE/SDD
converged: YES YES NO NO
title: Mulliken charges:
elementType: O O O C C C C C C C C C C H H H H H H H H H H H H H H H H H H H H
charge: -0.240451 -0.269720 -0.447531 -0.379999 -0.371170 -0.374839 -0.353255 -0.376919 -0.356071 -0.319986 -0.695401 0.226574 -0.361855 0.199193 0.194990 0.190013 0.191554 0.200893 0.193303 0.188511 0.189714 0.212638 0.232942 0.195452 0.194928 0.235524 0.229336 0.210450 0.209833 0.216158 0.235971 0.235473 0.363746
chargesum: 0.00000
title: Mulliken charges with hydrogens summed into heavy atoms:
elementType: O O O C C C C C C C C C C
charge: -0.240451 -0.269720 -0.083784 0.014184 0.010397 0.019358 0.024970 0.068662 0.034309 0.144874 -0.058960 0.226574 0.109589
polarizability: 1.55916775e+02 -4.68905240e+00 1.04886642e+02 -3.36821147e+00 -3.81549279e+00 9.98878483e+01
1716.lowfreq: -20.5092 -6.7075 0.0004 0.0007 0.0008 3.9026 16.6551 27.4955 37.0424
frequency: 11.0944 26.5534 37.0290 50.9426 62.7356 76.8769 85.7190 93.8083 131.3626 136.3414 165.1220 200.3338 216.9985 226.2096 286.0875 316.3027 331.2649 361.8968 425.4319 462.9657 517.9218 559.5032 648.3857 720.8256 730.0275 753.2063 792.0880 832.2802 862.1866 887.3364 912.2362 940.1699 991.6863 1008.8880 1013.6745 1016.7333 1025.1554 1045.0585 1072.6615 1076.2768 1081.4251 1122.2778 1166.6122 1183.0208 1185.7473 1193.1930 1218.4203 1230.1849 1254.9781 1262.0199 1265.5643 1278.7289 1285.5896 1291.3095 1295.0499 1302.9043 1335.9079 1352.7455 1355.3095 1368.1999 1388.4771 1395.8842 1453.7563 1459.4793 1461.3922 1462.3194 1466.8072 1471.6225 1476.0306 1478.5823 1485.3183 1488.8163 1623.5523 2949.9824 2952.5122 2955.6645 2963.0707 2968.5596 2971.4348 2985.4886 2986.7505 2992.6009 2994.6566 3005.7655 3023.0601 3023.8428 3030.0972 3038.0935 3056.3685 3067.8167 3071.0597 3106.8480 3469.5402
redmass: 2.5257 2.6440 3.9764 3.8008 4.8934 1.8784 2.5877 2.6902 1.8716 2.1277 3.5351 5.1830 3.4226 1.1153 2.9796 3.4375 1.3261 3.7479 3.0158 3.4271 3.5609 3.5041 4.6221 1.0630 1.0831 1.1120 1.2272 2.9853 1.4638 1.9286 4.4566 1.2860 4.6780 1.1421 1.9668 3.8843 4.5317 3.2747 2.7340 2.4468 2.1567 2.8323 1.7808 1.0867 3.0295 1.7312 1.2807 1.3781 1.3440 1.2928 1.2558 1.0287 1.1074 1.1158 1.1243 1.3092 1.4105 1.6224 1.6278 1.3389 1.2171 1.4304 1.1018 1.0725 1.0718 1.0742 1.0689 1.0786 1.0429 1.0797 1.0879 1.0955 8.0010 1.0590 1.0589 1.0590 1.0591 1.0589 1.0365 1.0969 1.0578 1.0676 1.0908 1.1020 1.1036 1.0590 1.1036 1.1045 1.1036 1.1008 1.0992 1.1085 1.0652
irintensity: 0.3220 1.0963 0.0734 1.7620 9.2036 1.8135 6.1471 0.1127 0.0257 0.0359 3.3619 4.2117 2.1249 0.0087 8.9136 50.5417 83.2300 9.1444 0.0839 0.1015 3.9759 24.6448 16.6828 14.3861 0.3720 4.0625 1.0648 11.6006 5.7327 4.1622 19.7516 0.3208 2.2926 1.1624 1.2655 37.2686 171.3953 3.0793 18.4373 0.1812 0.7820 17.3787 1.4689 6.9358 250.6807 48.4558 10.4159 4.0090 133.0013 5.9440 5.3231 0.8252 1.7259 0.1299 2.8918 1.6998 1.9176 0.7424 0.2011 1.3310 11.3535 39.0335 16.5752 7.2977 0.0752 0.1508 0.3295 1.5836 12.4328 1.5968 1.8276 33.0241 145.3187 0.0282 3.5941 0.3068 18.2512 151.1124 37.4675 0.1932 34.4808 18.0870 6.5176 1.3980 0.5622 36.8283 23.6258 96.0895 49.9110 98.6057 54.6538 26.3294 26.8639
temp: 298.150 k
press: 1.00000 atm
elementType: 8 8 8 6 6 6 6 6 6 6 6 6 6 1 1 1 1 1 1 1 1 1 1 1 1 1 1 1 1 1 1 1 1
symmnumber: 1
zpe: 752844.8 jmol-1
zpe.correction: 0.286743 hartree
zpe.thermalcorrener: 0.303675 hartree
zpe.thermalcorrenthalpy: 0.304619 hartree
zpe.thermalcorrgfe: 0.238016 hartree
zpe.sumelectzpe: -617.648910 hartree
zpe.sumelectthermal: -617.631979 hartree
zpe.sumelectthermalent: -617.631035 hartree
zpe.sumelectthermalfe: -617.697638 hartree
dipole: -3.2939 2.2151 -0.4662
dipole: 3.9968
quadrupole: -103.0459 -81.9246 -81.6492
quadrupole: 9.1156 -1.0833 0.3943
quadrupole: -14.1726 6.9486 7.2240 9.1156 -1.0833 0.3943
hfenergy: -617.9356538 hartree
pointgroup: C01 [X(C10H20O3)]
dipole: 1.2541717 0.4304422 0.8452109 debye
polarizability: 155.327123|7.3470123|98.4886164|3.2768913|1.7715562|106.875526 unknown
InChI: InChI=1S/C10H20O3/c1-2-3-4-5-6-7-8-13-10(12)9-11/h11H,2-9H2,1H3
charge 0 multiplicity 1
33 atoms
O  -3.015261 0.097163 0.816093
O  -3.287814 0.201839 -1.505891
O  -5.635963 -1.213672 -1.397217
C  2.003269 -0.255835 0.149206
C  3.357398 0.488445 0.15809
C  0.800226 0.668922 0.442436
C  4.560491 -0.429237 -0.155081
C  -0.548154 -0.090022 0.442035
C  5.91644 0.31296 -0.137139
C  -1.72182 0.855377 0.721334
C  7.11225 -0.607898 -0.462177
C  -3.674986 -0.160649 -0.365891
C  -4.965645 -0.942361 -0.139496
H  1.85805 -0.742144 -0.837582
H  2.029565 -1.073807 0.899058
H  3.508186 0.964678 1.149664
H  3.326035 1.315282 -0.582239
H  0.770783 1.478462 -0.316117
H  0.949846 1.163022 1.425145
H  4.590595 -1.261411 0.579435
H  4.415012 -0.899262 -1.150278
H  -0.529385 -0.885392 1.211962
H  -0.698788 -0.578997 -0.538834
H  5.88338 1.148538 -0.866047
H  6.064651 0.77647 0.85972
H  -1.823095 1.61772 -0.072189
H  -1.636834 1.338428 1.708356
H  7.004285 -1.057203 -1.467503
H  7.1855 -1.436267 0.267863
H  8.068689 -0.053796 -0.440874
H  -5.625926 -0.353772 0.527226
H  -4.723028 -1.892066 0.3755
H  -5.090953 -0.800416 -2.122568
