program: Gaussian 09
title: 000225084
version: EM64L-G09RevD.01
frameworkgroup: C1[X(C13H22O8S)]
method: RPBEPBE
basis: SDD
operation: Freq
keyword: #p
keyword: freq=noraman
keyword: PBEPBE/SDD
title: #p freq=noraman PBEPBE/SDD
converged: YES YES NO NO
title: Mulliken charges:
elementType: S O O O O O O O O C C C C C C C C C C C C C H H H H H H H H H H H H H H H H H H H H H H
charge: 1.051627 -0.248309 -0.316167 -0.237599 -0.322761 -0.408651 -0.267399 -0.515822 -0.498643 -0.141528 -0.142076 -0.099856 -0.096941 -0.084987 0.346387 -0.370931 0.373057 -0.663731 -0.693746 -0.692723 -0.692399 -0.741045 0.267098 0.268603 0.314654 0.268952 0.233649 0.235547 0.232257 0.228912 0.275283 0.199014 0.211174 0.245524 0.227244 0.240899 0.227478 0.215735 0.241333 0.215849 0.223668 0.328957 0.277724 0.284691
chargesum: 0.00000
title: Mulliken charges with hydrogens summed into heavy atoms:
elementType: S O O O O O O O O C C C C C C C C C C C C C
charge: 1.051627 -0.248309 -0.316167 -0.237599 -0.322761 -0.408651 -0.267399 -0.515822 -0.498643 0.125569 0.126527 0.214798 0.172010 0.148662 0.346387 0.096873 0.373057 0.039477 -0.009805 -0.008610 -0.011550 0.150328
polarizability: 2.29067839e+02 -3.77129627e+00 1.88182533e+02 5.64348973e+00 -3.89623284e+00 1.61674669e+02
1716.lowfreq: -2.3967 -0.0009 0.0011 0.0017 4.2233 7.2480 21.1231 30.6433 47.6560
frequency: 19.2977 30.3620 47.5738 57.9627 62.3853 74.5341 86.9383 114.7687 136.1281 150.5109 154.8495 169.7248 179.1591 183.9513 188.5434 200.7117 224.4322 232.3673 235.8842 244.1803 265.7530 277.0003 312.6376 326.4052 334.2493 341.2237 347.0739 364.3735 387.3111 398.1772 407.7710 471.0943 501.5211 508.0260 539.1842 574.3911 579.4614 589.3295 602.8008 646.9795 693.2393 707.5672 725.2019 738.3456 743.9971 769.1299 786.0544 833.3069 835.5328 858.8753 876.1918 910.8466 917.2193 925.4370 927.5651 929.5439 936.8855 954.4669 976.3110 980.9836 986.0316 989.2220 996.9129 1010.9897 1019.2874 1038.2755 1058.0626 1067.0588 1073.3041 1107.2824 1136.3208 1137.6061 1188.3932 1201.9906 1205.6921 1209.2447 1229.5345 1249.7183 1253.2887 1264.0207 1270.2892 1293.7041 1299.8210 1306.1811 1314.4982 1321.6031 1331.3105 1350.5219 1353.2331 1375.7025 1383.4726 1390.3748 1395.3784 1406.4929 1432.6082 1447.8247 1450.9762 1452.9130 1454.3190 1467.3690 1468.2959 1471.5057 1473.4517 1478.6391 2973.9001 2993.4007 3001.1144 3004.6746 3004.9007 3007.4069 3018.5308 3037.1772 3047.4726 3091.7338 3093.4278 3094.1200 3100.3180 3106.4459 3106.9419 3107.2702 3109.7757 3118.1912 3122.3280 3131.4200 3171.2399 3182.8994
redmass: 4.1315 5.1099 5.0638 4.4079 4.5894 5.1578 4.6910 4.6586 4.8680 1.0785 4.2828 3.4202 1.2624 3.3995 1.1828 1.9695 1.2994 1.3944 3.0687 2.6700 4.1657 3.7809 4.9230 2.5282 3.4383 3.6524 8.9320 5.6120 2.7400 2.8587 5.1217 3.5577 8.9855 4.8712 6.7458 4.1667 4.0692 6.2607 4.2074 5.2643 5.6318 4.8631 8.9477 4.8939 4.0069 5.7664 4.4909 10.7852 4.8798 5.2980 4.1229 2.9625 1.6232 1.5010 3.2165 4.0641 2.3751 2.1288 3.8595 1.3591 1.3960 2.9013 1.4445 3.9260 2.3622 5.4919 2.4506 2.8397 3.3075 2.2221 1.9675 1.8518 1.2941 1.4265 2.6456 2.3500 1.2942 2.0697 1.9758 1.9508 1.6438 1.3895 1.3610 1.1458 1.1639 1.1943 1.3017 1.2913 1.3147 1.2837 1.2821 1.2395 1.2202 1.0490 1.0540 1.0479 1.0528 1.0502 1.0485 1.0773 1.0528 1.0600 1.0597 1.0583 1.0850 1.0355 1.0369 1.0577 1.0406 1.0360 1.0242 1.0846 1.0861 1.0883 1.0987 1.0999 1.1005 1.1027 1.0993 1.0992 1.0896 1.1007 1.1008 1.0987 1.1090 1.1075
irintensity: 0.4873 4.9964 1.7760 0.4783 1.2521 0.9603 1.5545 4.8346 16.3526 0.7663 1.6405 0.5079 2.2092 4.9071 0.6044 1.6931 0.8487 0.1144 0.6283 2.1441 1.4910 1.3773 11.5687 0.5849 0.7802 13.1591 28.3940 23.2769 1.7889 7.8192 2.6945 10.0803 39.6107 9.2103 3.3817 14.0239 5.9441 33.0415 0.1420 10.2608 10.8227 5.5567 19.5173 49.8719 54.8939 38.3368 26.2838 57.2062 74.0944 54.5222 25.5513 26.6450 4.7306 0.5446 44.6474 121.0056 16.3437 8.3666 27.4018 4.7170 5.3452 44.8532 67.2559 52.7267 74.3437 99.3362 14.6946 121.0159 47.6732 3.1628 40.7998 53.8739 30.2959 23.6143 80.7555 89.4219 11.4052 27.5071 33.1396 32.7435 15.6889 5.7538 1.6847 3.7782 2.0677 7.6906 3.4514 6.6514 2.7711 43.1779 41.6204 30.6881 32.8428 8.6220 15.6959 0.4194 3.4835 4.2241 0.1033 2.2174 12.5385 20.9252 17.3294 7.9127 32.3639 8.3316 10.5112 37.9583 5.7855 17.7868 14.6555 8.8823 13.5566 5.1382 8.4054 8.6419 27.5024 13.7746 40.3671 25.3228 23.2672 20.8485 14.7135 14.3875 15.5405 0.9211
temp: 298.150 k
press: 1.00000 atm
elementType: 16 8 8 8 8 8 8 8 8 6 6 6 6 6 6 6 6 6 6 6 6 6 1 1 1 1 1 1 1 1 1 1 1 1 1 1 1 1 1 1 1 1 1 1
symmnumber: 1
zpe: 909360.1 jmol-1
zpe.correction: 0.346357 hartree
zpe.thermalcorrener: 0.370444 hartree
zpe.thermalcorrenthalpy: 0.371388 hartree
zpe.thermalcorrgfe: 0.292506 hartree
zpe.sumelectzpe: -1506.474801 hartree
zpe.sumelectthermal: -1506.450715 hartree
zpe.sumelectthermalent: -1506.449770 hartree
zpe.sumelectthermalfe: -1506.528652 hartree
dipole: 1.1862 3.1198 -0.6866
dipole: 3.4076
quadrupole: -124.2221 -154.4763 -139.9586
quadrupole: 12.5081 1.4299 -2.4335
quadrupole: 15.3302 -14.9240 -0.4063 12.5081 1.4299 -2.4335
hfenergy: -1506.8211583 hartree
pointgroup: C01 [X(C13H22O8S1)]
dipole: 0.8534852 -0.8863674 0.5322216 debye
polarizability: 221.7075137|11.5913987|187.2671575|-12.5684355|-15.0823313|169.9503701 unknown
InChI: InChI=1S/C13H22O8S/c1-12(2)16-6-7(18-12)8-9(21-22(5,14)15)10-11(17-8)20-13(3,4)19-10/h7-11H,6H2,1-5H3
charge 0 multiplicity 1
44 atoms
S  2.025297 2.972385 -1.182873
O  -0.495653 -1.37687 -0.915826
O  2.167963 -0.073189 0.594591
O  1.245069 -2.22888 0.526295
O  -2.48549 0.292753 0.477733
O  1.167983 1.314132 -1.594949
O  -4.451445 -0.53599 -0.549632
O  1.313701 3.563716 0.151892
O  2.060925 3.824579 -2.55089
C  -0.842632 -0.004245 -1.329516
C  0.708498 0.107169 0.596385
C  0.153935 0.946458 -0.606701
C  0.127803 -1.330399 0.429601
C  -2.30421 0.33733 -0.994771
C  2.483189 -1.480499 0.178926
C  -3.349204 -0.665926 -1.523712
C  -3.815677 -0.352195 0.772079
C  2.778277 -1.572595 -1.323299
C  3.605925 -1.994988 1.073486
C  -3.556632 -1.702765 1.453692
C  -4.682209 0.609378 1.580092
C  3.760604 2.321689 -0.772895
H  -0.695617 0.052369 -2.422891
H  0.435612 0.574019 1.553607
H  -0.343555 1.854537 -0.22111
H  -0.611391 -1.643651 1.179261
H  -2.523644 1.364396 -1.353966
H  -3.762163 -0.398731 -2.508177
H  -2.93782 -1.693109 -1.537267
H  2.899134 -2.632705 -1.605359
H  1.958991 -1.140647 -1.916737
H  3.713646 -1.035052 -1.560527
H  4.525549 -1.407927 0.907881
H  3.310154 -1.911898 2.131029
H  3.817445 -3.052166 0.840263
H  -2.971458 -2.364052 0.792072
H  -4.515983 -2.195226 1.688605
H  -2.997887 -1.555296 2.394668
H  -4.780086 1.566384 1.043223
H  -4.227427 0.796495 2.567549
H  -5.687756 0.178667 1.72702
H  3.589204 1.545597 -0.013298
H  4.145612 1.914163 -1.717351
H  4.333922 3.189682 -0.417603
