program: Gaussian 09
title: 000225035
version: EM64L-G09RevD.01
frameworkgroup: C1[X(C7H10N2O3)]
method: RPBEPBE
basis: SDD
operation: Freq
keyword: #p
keyword: freq=noraman
keyword: PBEPBE/SDD
title: #p freq=noraman PBEPBE/SDD
converged: NO YES NO NO
title: Mulliken charges:
elementType: O O O N N C C C C C C C H H H H H H H H H H
charge: -0.217937 -0.213850 -0.242682 -0.367267 -0.366693 -0.139175 -0.535923 -0.382766 0.165616 0.186535 -0.687914 0.170509 0.258637 0.254638 0.262541 0.215996 0.227070 0.237826 0.216071 0.222548 0.367195 0.369024
chargesum: 0.00000
title: Mulliken charges with hydrogens summed into heavy atoms:
elementType: O O O N N C C C C C C C
charge: -0.217937 -0.213850 -0.242682 -0.000072 0.002331 0.119462 -0.018744 0.060300 0.165616 0.186535 -0.011468 0.170509
polarizability: 1.08971769e+02 -2.81678753e+00 1.08104699e+02 1.08686972e+01 3.53248205e+00 7.30430813e+01
1716.lowfreq: -9.9185 -6.0261 -0.0006 -0.0003 0.0002 3.9048 42.2511 86.8177 99.6569
frequency: 42.2115 86.7619 99.6287 137.3200 146.4086 179.5698 226.6742 251.9638 298.9481 351.4109 372.2834 409.6833 431.5292 541.4627 557.1497 579.3947 665.1946 675.7165 739.8515 751.9681 787.2451 809.1202 826.5482 854.3995 889.6673 958.1905 989.3938 1039.3622 1046.4305 1092.1759 1114.3063 1186.5536 1235.9907 1253.4091 1281.2485 1319.4154 1331.9478 1353.4959 1354.6831 1360.4421 1390.5921 1404.7154 1412.9897 1453.9507 1471.2895 1478.1428 1483.1013 1616.4094 1632.2126 1650.4856 2984.2524 2988.2041 2997.9918 3027.8664 3044.5411 3085.0712 3088.9168 3090.5253 3478.4472 3486.6282
redmass: 6.0630 2.2715 3.6676 7.1245 5.7806 2.3160 1.4365 3.0603 4.9400 5.6370 3.9333 6.6609 6.0572 2.8932 4.9897 6.6401 2.9535 3.5622 2.6940 2.8307 1.5504 1.9286 1.5509 2.3643 2.2596 2.4444 2.3889 2.6548 1.8913 1.8246 2.4479 1.3816 1.8122 1.5428 2.2590 1.3760 1.3365 1.9268 1.8525 6.0881 2.2615 1.2101 1.4015 1.0804 1.0721 1.0413 1.0656 10.0896 5.5120 3.4168 1.0588 1.0376 1.0661 1.0910 1.0954 1.1001 1.0999 1.0960 1.0746 1.0753
irintensity: 0.9072 1.8790 1.3720 3.8019 5.0739 0.8160 1.5491 3.1442 6.2319 16.7342 1.5969 24.9581 0.4735 2.7275 19.2942 8.4949 9.9114 8.2435 22.0940 17.6138 25.7285 1.4525 177.8946 25.1474 11.0321 9.2322 7.0462 3.7908 8.8876 6.5005 24.4144 93.2375 38.8711 47.9616 102.9532 11.2955 15.7991 93.7508 164.6115 322.4723 0.0704 13.1933 24.0203 24.3298 1.3663 13.5785 8.0582 89.0096 374.7731 391.3126 22.0061 20.1235 8.1637 2.7093 13.3612 36.7320 23.8736 15.6347 59.0442 54.9778
temp: 298.150 k
press: 1.00000 atm
elementType: 8 8 8 7 7 6 6 6 6 6 6 6 1 1 1 1 1 1 1 1 1 1
symmnumber: 1
zpe: 453955.8 jmol-1
zpe.correction: 0.172903 hartree
zpe.thermalcorrener: 0.184386 hartree
zpe.thermalcorrenthalpy: 0.185331 hartree
zpe.thermalcorrgfe: 0.135019 hartree
zpe.sumelectzpe: -607.049891 hartree
zpe.sumelectthermal: -607.038407 hartree
zpe.sumelectthermalent: -607.037463 hartree
zpe.sumelectthermalfe: -607.087775 hartree
dipole: -1.4067 -1.4290 -0.4637
dipole: 2.0581
quadrupole: -80.8714 -82.0349 -68.6049
quadrupole: 6.7102 -4.6417 0.1260
quadrupole: -3.7010 -4.8645 8.5655 6.7102 -4.6417 0.1260
hfenergy: -607.2227939 hartree
pointgroup: C01 [X(C7H10N2O3)]
dipole: 0.5096946 -0.6105724 0.1519421 debye
dipolederiv: -1.0029923 -0.0714506 -0.2187405 -0.2584118 -0.6117834 -0.121896 -0.2548919 -0.0431946 -0.4004417 -0.6566205 -0.3509455 -0.0372933 -0.2492846 -0.9785718 0.0802982 -0.1538548 -0.0507578 -0.3789487 -0.8275385 0.2351599 -0.1690903 0.2518157 -0.9937826 0.1946855 -0.2041736 0.2209626 -0.4746508 -1.5148574 0.0783399 -0.3517096 0.3196621 -0.4626488 0.08324 -0.4268811 0.0066138 -0.4598566 -0.457198 -0.0303514 -0.0138075 -0.2796966 -1.5748445 0.1680239 0.0457542 0.3098516 -0.4002587 0.068727 -0.0175441 -0.0068322 0.0440981 -0.1624177 -0.0698605 0.0128235 -0.1211316 0.0072446 -0.1496764 0.0173804 -0.1161037 -0.0411734 -0.0012299 -0.0194353 -0.1326748 0.0309637 -0.0338882 0.0748976 -0.0543257 0.0042454 -0.0482783 0.086509 0.0048771 -0.0308557 0.0995168 0.1449511 1.539605 -0.0662509 0.4132112 -0.3615903 0.971235 0.0416275 0.4985534 0.0050996 0.278619 0.7424659 0.0223286 0.2782362 0.3330835 1.6257281 -0.2516487 0.28633 -0.3537211 0.4687406 -0.0131556 -0.0239509 0.0497968 -0.0211212 0.05473 -0.0132419 0.083274 -0.0068166 0.0238354 1.7070532 0.1496089 0.4039715 0.1860098 1.7581168 -0.1765147 0.5294101 -0.1392292 0.5462804 -0.0456783 0.0287034 -0.085956 0.0013472 0.046383 0.0149193 -0.0508199 0.0360981 0.0277132 0.0141704 0.0249559 0.0355198 0.0337061 0.070738 -0.0986441 0.0399907 -0.0575603 -0.0280834 0.0531195 -0.0109804 -0.0117299 0.0125977 -0.0619111 0.0552165 -0.0090888 0.0032639 0.1075577 -0.0753079 0.0452444 -0.0834992 0.0661799 0.0382391 0.0506527 -0.0677318 0.0291037 -0.0153177 0.0512441 -0.0482729 0.0245971 -0.0391675 -0.1392029 -0.0014292 0.0361596 -0.0069917 0.0432483 0.0697873 -0.0071424 0.0062706 -0.0452374 -0.1225002 0.0288318 -0.0278503 0.0024233 0.104949 -0.045426 0.0533665 -0.057357 0.059666 0.0515603 0.0626163 -0.129422 0.0780514 -0.0014981 0.0547171 0.0066026 0.0378008 0.0264585 0.0678051 -0.0907512 0.0831598 -0.0906522 -0.1325977 0.1534821 0.0178446 -0.0579151 0.0222069 0.2143904 0.0165063 -0.0794052 0.0284419 0.289134 0.2591815 0.0016799 -0.0436151 -0.0128705 0.123458 0.0419266 -0.0478053 0.0196648 0.2832681 unknown
polarizability: 109.9401294|2.3154485|107.8776472|9.674773|-3.4609596|72.3017727 unknown
InChI: InChI=1S/C7H10N2O3/c1-2-4-3-5(10)8-7(12)9-6(4)11/h4,8-9H,2-3H2,1H3
charge 0 multiplicity 1
22 atoms
O  2.217575 1.436266 0.950174
O  -2.188405 -2.165537 0.025289
O  -1.912413 2.331079 -0.747561
N  0.040145 1.608546 0.249641
N  -1.768229 0.060345 -0.357317
C  1.084831 -0.691876 0.532835
C  -0.226634 -1.241723 1.156213
C  1.339778 -1.225197 -0.913254
C  1.171476 0.826033 0.601125
C  -1.443788 -1.17545 0.250962
C  2.748534 -0.894464 -1.44643
C  -1.236573 1.364191 -0.298988
H  1.924149 -1.037585 1.163647
H  -0.449189 -0.71149 2.103464
H  -0.0961 -2.308139 1.402199
H  0.572476 -0.826954 -1.605305
H  1.196587 -2.323385 -0.888019
H  2.926783 0.194656 -1.484812
H  3.532021 -1.334434 -0.802937
H  2.879377 -1.297435 -2.466439
H  0.233077 2.617857 0.293116
H  -2.648482 0.033897 -0.887602
