program: Gaussian 09
title: 000225029
version: EM64L-G09RevD.01
frameworkgroup: C1[X(C2H4N4)]
method: RPBEPBE
basis: SDD
operation: Freq
keyword: #p
keyword: freq=noraman
keyword: PBEPBE/SDD
title: #p freq=noraman PBEPBE/SDD
converged: NO NO NO NO
title: Mulliken charges:
elementType: N N N N C C H H H H
charge: -0.286830 -0.286828 -0.513427 -0.513428 0.121655 0.121656 0.339293 0.339308 0.339308 0.339293
chargesum: 0.00000
title: Mulliken charges with hydrogens summed into heavy atoms:
elementType: N N N N C C
charge: -0.286830 -0.286828 0.165174 0.165173 0.121655 0.121656
polarizability: 8.41213629e+01 -3.05452136e-03 4.35596962e+01 -1.17994145e-03 -6.83717417e-06 2.23613514e+01
1716.lowfreq: -192.6804 -10.6989 -0.0006 0.0005 0.0008 9.8204 17.9790 133.8028 277.0303
frequency: -192.6797 133.8028 277.0303 444.0526 542.8620 567.5175 585.7021 597.4837 636.1253 670.6249 751.1425 824.6218 923.0442 1004.9529 1126.0229 1404.1706 1473.0965 1585.8143 1621.3589 1726.8882 3522.2222 3527.3975 3667.1353 3667.3970
redmass: 6.4005 4.5815 2.8062 3.6207 1.0920 1.3974 1.0078 1.2581 4.7280 5.5317 11.5905 7.9934 1.7837 12.3583 1.5037 3.7136 3.2390 1.1587 1.4287 7.7168 1.0440 1.0457 1.1045 1.1047
irintensity: 0.0000 48.3848 29.4952 0.0000 0.0001 0.0012 0.0016 546.8450 0.0005 0.0000 62.5259 59.4352 14.6165 0.0000 0.0000 118.0412 491.3340 0.0001 565.6634 0.0000 229.1849 0.0002 108.9488 0.0225
temp: 298.150 k
press: 1.00000 atm
elementType: 7 7 7 7 6 6 1 1 1 1
symmnumber: 1
zpe: 187098.7 jmol-1
zpe.correction: 0.071262 hartree
zpe.thermalcorrener: 0.076748 hartree
zpe.thermalcorrenthalpy: 0.077692 hartree
zpe.thermalcorrgfe: 0.042637 hartree
zpe.sumelectzpe: -297.096443 hartree
zpe.sumelectthermal: -297.090957 hartree
zpe.sumelectthermalent: -297.090013 hartree
zpe.sumelectthermalfe: -297.125069 hartree
dipole: 0.0000 0.0000 0.0030
dipole: 0.0030
quadrupole: -8.7058 -41.3806 -37.9154
quadrupole: -0.0001 -0.0007 0.0000
quadrupole: 20.6281 -12.0467 -8.5815 -0.0001 -0.0007 0.0000
hfenergy: -297.1677055 hartree
pointgroup: C01 [X(C2H4N4)]
dipole: 0.0000046 0.0000021 0.001198 debye
dipolederiv: -0.9454196 0.0025173 -0.0000091 0.002437 -0.768916 -0.0000367 -0.0000155 0.0000031 -0.3813932 -0.9454178 0.0025189 -0.0000103 0.0024379 -0.7689161 0.0000367 -0.0000107 -0.0000031 -0.3813922 -1.5294326 0.0195028 0.0002903 0.0193625 -0.167044 -0.0000071 0.001003 -0.0000176 -0.5774357 -1.5294326 0.0195043 -0.0003194 0.0193661 -0.1670449 0.0000074 -0.0010249 0.0000178 -0.5774371 2.0020488 -0.0204958 -0.0002421 -0.0202929 0.5673145 0.000006 -0.0001952 0.0000039 0.180645 2.0020496 -0.0204977 0.0003097 -0.0202942 0.5673165 -0.0000065 0.000276 -0.0000046 0.180645 0.2378423 0.0172212 -0.0000338 0.08375 0.182852 -0.0000401 -0.0003488 -0.0001238 0.3890912 0.2349598 -0.0187454 -0.0000322 -0.0852581 0.1857929 0.0000429 -0.0003473 0.0001359 0.3890927 0.2349594 -0.0187461 0.0000226 -0.0852585 0.1857929 -0.0000452 0.0003307 -0.0001338 0.3890924 0.2378427 0.0172205 0.0000243 0.0837502 0.1828522 0.0000426 0.0003326 0.0001221 0.3890919 unknown
polarizability: 84.1131416|-0.5774159|43.5679175|0.0011799|-0.0000099|22.3613514 unknown
InChI: InChI=1S/C2H4N4/c3-1-5-2(4)6-1/h3-4H2
charge 0 multiplicity 1
10 atoms
N  0.015771 1.11179 0.0003
N  -0.015731 -1.112133 0.000299
N  2.246068 -0.031998 0.000006
N  -2.246028 0.031658 -0.000082
C  0.90652 -0.012912 0.000267
C  -0.906479 0.012568 0.000245
H  2.769507 0.842685 0.000524
H  2.744256 -0.921304 0.000535
H  -2.74421 0.920967 0.000409
H  -2.769472 -0.843021 0.000398
