program: Gaussian 09
title: 000225012
version: EM64L-G09RevD.01
frameworkgroup: C1[X(C19H19N)]
method: RPBEPBE
basis: SDD
operation: Freq
keyword: #pfreq=noraman
keyword: PBEPBE/SDD
title: #p freq=noraman PBEPBE/SDD
converged: YES YES NO NO
title: Mulliken charges:
elementType: N C C C C C C C C C C C C C C C C C C C H H H H H H H H H H H H H H H H H H H
charge: -0.025854 -0.371296 -0.370266 -0.523277 -0.570495 0.145256 0.505423 -0.337228 -0.091196 0.420271 -0.318699 -0.410540 -0.418570 -0.331511 -0.389986 -0.230601 -0.228054 -0.244436 -0.221800 -0.251763 0.199911 0.223305 0.216503 0.206759 0.233522 0.204680 0.208968 0.204976 0.237324 0.240908 0.229637 0.232076 0.262264 0.232785 0.221945 0.222676 0.226345 0.230919 0.229119
chargesum: 0.00000
title: Mulliken charges with hydrogens summed into heavy atoms:
elementType: N C C C C C C C C C C C C C C C C C C C
charge: -0.025854 0.051921 0.052995 -0.085076 -0.156550 0.145256 0.505423 -0.099904 -0.091196 0.420271 -0.077791 -0.180902 -0.186494 -0.069248 -0.157202 -0.008656 -0.005378 -0.018090 0.009119 -0.022644
polarizability: 3.23267592e+02 1.96129266e+01 2.06923106e+02 -3.61734972e+01 4.24053757e+00 1.12955732e+02
1716.lowfreq: -10.5463 -5.2350 -1.1907 -0.0009 -0.0008 -0.0002 15.6411 22.6067 29.2214
frequency: 14.8499 20.4957 28.6263 32.6190 64.3065 99.1349 112.9909 125.1959 171.6065 189.3784 246.2385 268.8282 325.1593 336.9289 360.1111 398.6301 403.8505 423.6401 476.5276 485.2782 516.1134 518.0635 549.1893 584.9395 614.7912 617.9747 680.4299 705.9575 726.9682 736.8622 752.8159 760.5115 767.8135 782.1488 802.1033 810.3261 843.4331 853.7441 872.1361 886.0755 906.5450 916.6084 938.6853 963.1522 976.0273 983.4236 989.7716 993.1520 995.9546 1005.4077 1016.1435 1027.6464 1040.5416 1042.5010 1060.6800 1083.1103 1110.2373 1115.6194 1147.3466 1165.1684 1171.2805 1186.7794 1215.8614 1222.4784 1229.4304 1233.7556 1239.1159 1265.9465 1279.4830 1286.2180 1297.1199 1304.2851 1327.5691 1332.4533 1344.8352 1366.0461 1382.6684 1403.7600 1419.3960 1440.3166 1456.2274 1462.8000 1466.0476 1474.1336 1484.1710 1487.5450 1502.3800 1551.0833 1593.1849 1596.3748 1614.4986 1624.9306 2962.8506 2968.4811 2978.2354 2985.1718 3007.2321 3024.4006 3046.9016 3067.5633 3112.5795 3114.5694 3118.8620 3122.6883 3130.1129 3135.6540 3141.9047 3150.5214 3154.0451 3160.7857 3169.2602
redmass: 4.7409 3.9548 3.7580 4.1440 5.1315 2.5333 1.8792 4.6399 4.1635 4.5367 4.1674 3.0326 3.4636 2.4818 4.3577 3.3724 2.8244 3.2621 3.2034 3.8507 3.7918 6.1050 3.9390 4.2041 7.1211 6.3560 3.5625 1.7550 3.1544 1.1123 3.6613 1.7629 1.5990 1.3027 3.2513 3.4056 1.5474 1.2504 2.6184 1.7013 1.9235 1.4616 3.6627 1.3572 1.3859 1.3837 6.2637 1.3274 1.3307 3.9184 2.1647 2.1814 4.9122 1.7091 2.5227 1.5234 1.7027 1.2406 1.1795 1.1120 1.0515 1.1147 2.3582 1.7014 1.3007 1.6558 1.9447 1.7691 1.3390 1.0721 1.5717 2.2002 1.2723 1.4144 1.5289 3.3958 7.7697 4.9004 2.2229 2.1829 1.3674 1.8631 1.0970 1.1331 2.2694 1.1049 3.5405 7.3025 6.0501 6.4326 6.1719 6.6817 1.0597 1.0595 1.0601 1.0636 1.0964 1.1009 1.1038 1.1014 1.0868 1.0868 1.0874 1.0878 1.0908 1.0889 1.0958 1.0980 1.0947 1.1015 1.0995
irintensity: 0.1903 0.0571 0.2118 0.4137 0.1165 0.3021 0.0653 1.1138 4.6335 1.6912 0.7028 1.1302 0.1248 0.1378 1.0553 0.4990 0.0001 6.8543 12.6560 0.5827 8.3207 1.1739 0.3152 5.9558 3.7899 0.0611 0.3132 51.8583 1.5746 5.2709 2.7633 83.7189 24.4438 0.3896 0.0593 0.6291 65.8394 0.0381 1.7376 2.5530 0.3645 2.9340 0.6512 2.6142 0.0273 2.5423 0.1041 0.1348 0.1183 1.3680 7.5375 9.3067 2.2923 1.4760 0.2518 8.3153 4.7007 8.3508 1.4902 2.1864 0.0952 0.1465 0.1717 7.5531 23.3261 0.6869 9.7854 4.7391 0.5761 0.0509 0.8117 12.6431 0.6487 6.6584 0.2326 10.6864 0.1284 4.3895 16.1468 6.4152 2.8354 2.6181 1.3153 0.6739 23.4930 17.3423 48.4524 20.8244 1.4177 54.7343 13.5156 12.5435 5.7440 4.8688 55.4811 55.7018 5.3144 0.8530 40.6972 39.5824 10.7084 7.7341 3.6898 9.1085 11.7962 11.1817 47.8692 23.3276 26.7174 27.0368 24.1491
temp: 298.150 k
press: 1.00000 atm
elementType: 7 6 6 6 6 6 6 6 6 6 6 6 6 6 6 6 6 6 6 6 1 1 1 1 1 1 1 1 1 1 1 1 1 1 1 1 1 1 1
symmnumber: 1
zpe: 850894.8 jmol-1
zpe.correction: 0.324089 hartree
zpe.thermalcorrener: 0.341315 hartree
zpe.thermalcorrenthalpy: 0.342259 hartree
zpe.thermalcorrgfe: 0.275115 hartree
zpe.sumelectzpe: -788.776707 hartree
zpe.sumelectthermal: -788.759481 hartree
zpe.sumelectthermalent: -788.758537 hartree
zpe.sumelectthermalfe: -788.825680 hartree
dipole: 0.9402 -1.7341 -0.6480
dipole: 2.0763
quadrupole: -104.6274 -106.1781 -124.9527
quadrupole: -2.6333 -7.5433 -0.0036
quadrupole: 7.2920 5.7413 -13.0333 -2.6333 -7.5433 -0.0036
hfenergy: -789.1007956 hartree
pointgroup: C01 [X(C19H19N1)]
dipole: -0.371869 -0.6580595 0.3097777 debye
polarizability: 322.8911698|-22.9735927|205.8335512|-35.0897623|-11.4849155|114.4217094 unknown
InChI: InChI=1S/C19H19N/c1-2-8-16(9-3-1)10-4-6-12-18-15-14-17-11-5-7-13-19(17)20-18/h1-3,5,7-9,11,13-15H,4,6,10,12H2
charge 0 multiplicity 1
39 atoms
N  -2.496005 0.60429 -0.706568
C  0.664567 -0.268145 0.16655
C  2.142669 -0.15932 -0.265418
C  -0.296767 -0.425944 -1.044341
C  3.110311 -0.029358 0.944194
C  -1.749553 -0.51843 -0.617591
C  4.566888 0.084753 0.518449
C  -2.280644 -1.757722 -0.108491
C  -3.822638 0.554359 -0.290599
C  -4.431831 -0.652294 0.232019
C  -3.607557 -1.823049 0.310451
C  5.344925 -1.076648 0.272282
C  5.16989 1.353296 0.316361
C  -4.611673 1.744566 -0.389511
C  -5.8052 -0.627404 0.636362
C  6.684951 -0.975479 -0.164579
C  6.509835 1.461061 -0.120555
C  7.272961 0.295511 -0.363569
C  -5.950283 1.741194 0.012948
C  -6.552094 0.548751 0.529233
H  0.542778 -1.130577 0.854368
H  0.372665 0.635082 0.738313
H  2.27363 0.716852 -0.931673
H  2.426188 -1.049952 -0.862537
H  -0.186755 0.446604 -1.712461
H  -0.010194 -1.331574 -1.615372
H  2.816928 0.858911 1.537554
H  2.973652 -0.912038 1.600301
H  -1.630745 -2.638187 -0.06352
H  -4.0317 -2.758022 0.695897
H  4.89752 -2.066354 0.430836
H  4.585178 2.262042 0.508195
H  -4.129039 2.642263 -0.788202
H  -6.262668 -1.543211 1.030814
H  7.271213 -1.884002 -0.345125
H  6.958959 2.450249 -0.266809
H  8.313037 0.37617 -0.699238
H  -6.548229 2.655922 -0.065635
H  -7.602671 0.564337 0.839568
