program: Gaussian 09
title: 000225016
version: EM64L-G09RevD.01
frameworkgroup: C1[X(C19H32ClNO)]
method: RPBEPBE
basis: SDD
operation: Freq
keyword: #p
keyword: freq=noraman
keyword: PBEPBE/SDD
title: #p freq=noraman PBEPBE/SDD
converged: NO YES NO NO
title: Mulliken charges:
elementType: Cl O N C C C C C C C C C C C C C C C C C C C H H H H H H H H H H H H H H H H H H H H H H H H H H H H H H H H
charge: -0.082434 -0.464387 -0.102562 -0.371544 -0.363652 -0.424558 -0.386391 -0.370223 -0.219913 -0.331128 -0.335091 0.509467 -0.348237 -0.357582 -0.396429 -0.405468 -0.709312 -0.695140 -0.275078 -0.398932 0.516207 -0.801747 0.197909 0.195275 0.195848 0.186519 0.178458 0.237828 0.188324 0.198182 0.191711 0.199364 0.204758 0.230206 0.173138 0.183377 0.183669 0.183038 0.201848 0.196182 0.200520 0.258682 0.273048 0.335306 0.228376 0.204693 0.207787 0.210131 0.209011 0.217669 0.231500 0.244700 0.246111 0.220968
chargesum: 0.00000
title: Mulliken charges with hydrogens summed into heavy atoms:
elementType: Cl O N C C C C C C C C C C C C C C C C C C C
charge: -0.082434 -0.129081 -0.102562 0.021640 0.018714 -0.008272 0.000115 0.020852 -0.015155 0.072217 0.031955 0.509467 0.036649 0.039120 -0.137747 -0.132420 -0.068457 -0.058330 -0.275078 -0.167432 0.516207 -0.089968
polarizability: 2.54850679e+02 9.21458652e+00 2.40009226e+02 -2.76873503e+00 1.44829887e+01 1.77598035e+02
1716.lowfreq: -13.4643 -7.9183 0.0015 0.0017 0.0018 5.4064 9.2017 13.9357 19.1740
frequency: -3.9000 13.3026 19.0049 36.8589 40.4289 45.3395 53.9425 67.1970 85.9302 98.7212 105.9534 125.1264 128.2104 132.2248 142.7442 161.2113 163.7907 186.2006 224.1502 229.3915 231.0834 237.4008 246.6165 262.7044 278.8521 289.7368 303.9453 326.1933 338.8725 387.0088 390.7916 410.7108 428.4602 433.6704 445.7670 460.0521 501.2999 540.4679 583.3594 603.0980 677.5222 708.4464 717.9368 723.5681 725.8613 750.9415 763.5091 817.3019 834.4025 839.8044 844.8484 848.8743 869.6621 892.2046 914.6492 921.9622 951.4520 962.6849 971.8292 986.7436 995.3811 1002.2469 1012.6737 1021.2326 1031.0958 1046.8451 1049.7064 1056.3478 1073.1929 1076.4192 1092.1670 1100.8743 1115.3789 1119.1881 1144.9946 1149.3824 1165.9637 1184.1525 1208.5207 1211.6246 1226.8722 1232.9692 1234.8459 1249.1867 1262.8310 1273.1061 1277.8512 1279.8427 1283.2553 1285.5412 1288.4542 1294.6544 1300.8529 1319.1624 1336.2482 1350.5551 1353.4122 1357.0867 1360.8653 1366.9335 1371.6803 1386.4212 1389.9644 1390.9355 1400.7018 1402.4756 1449.9610 1461.0130 1462.9224 1464.2402 1465.0578 1466.5031 1472.0021 1472.7648 1473.8025 1476.9271 1478.4152 1479.5933 1482.3759 1488.1493 1489.7537 1495.0290 1568.4640 1620.8608 2802.7561 2849.1841 2862.2126 2952.2141 2953.2314 2954.8038 2959.7308 2967.1408 2969.7758 2970.3191 2972.8347 2981.0484 2981.8554 2992.1390 3003.5859 3005.8470 3009.4247 3022.8899 3033.4183 3045.7571 3048.0504 3055.7664 3060.7787 3064.6372 3069.3566 3071.3588 3072.3157 3092.1524 3129.0366 3164.0237 3172.5618 3549.1208
redmass: 3.9302 4.5108 4.8224 4.3232 3.3577 1.6976 3.4394 1.8926 3.2779 2.9853 2.9468 2.0845 1.9458 1.2605 2.4045 4.2286 4.1003 3.5936 1.7142 2.3749 1.1364 2.5236 2.0995 2.8200 1.9186 2.4645 2.1270 3.7065 3.0217 3.1055 3.6899 2.7311 3.5079 3.0642 3.2736 3.4266 2.8966 3.1782 5.2049 3.7963 7.0235 2.8382 3.3164 1.1573 1.0799 1.2160 1.3796 1.8327 4.2360 1.3217 1.3007 1.7780 1.4984 1.8372 1.8065 1.4956 1.8738 1.2782 1.3962 4.4915 1.5741 2.0518 3.6036 2.8487 3.0443 1.5209 2.6229 2.8226 2.2851 2.3916 2.1486 1.9589 1.9219 2.3409 1.7514 1.3185 1.7207 2.0028 1.4304 1.3638 1.4415 2.7086 1.3552 1.4294 1.3792 1.2362 1.3374 1.1694 1.1484 1.1104 1.1263 1.1880 1.1969 1.3975 1.4241 1.6366 1.6136 2.0677 1.4788 1.3677 1.6598 3.2723 1.2251 1.2177 1.3930 1.5518 1.0981 1.0753 1.0461 1.0839 1.0737 1.0703 1.1119 1.0854 1.0751 1.0558 1.0425 1.0672 1.0775 1.0882 1.0738 3.1249 6.1212 7.3555 1.0715 1.0709 1.0711 1.0589 1.0838 1.0609 1.0636 1.0609 1.0577 1.0370 1.0376 1.0599 1.0369 1.0976 1.0954 1.0874 1.0974 1.1020 1.0893 1.1014 1.1013 1.0872 1.0973 1.0994 1.1007 1.1003 1.0992 1.0996 1.0896 1.0922 1.0944 1.0657
irintensity: 0.0177 0.0992 0.0609 0.0259 0.1962 0.1168 0.8382 0.0105 0.5651 0.4430 2.1731 0.0505 0.0248 0.1072 0.2879 0.0782 1.4125 1.7432 7.5721 2.3528 0.0712 1.5272 13.8126 1.5498 60.0798 8.0948 52.9489 11.4755 5.3494 2.0897 1.0673 2.2559 1.0445 3.6923 7.1515 4.8248 9.2594 7.1055 10.6773 12.2869 26.7487 7.6961 3.7029 2.6400 16.5884 2.6886 4.0934 5.7712 9.9577 35.5219 1.6570 4.4305 16.6532 6.2308 3.4306 5.5292 8.7375 1.6597 3.2262 21.3704 6.1590 24.9515 4.2659 18.9720 33.6341 8.9069 6.5177 3.5311 16.8162 5.1733 33.5291 36.8528 5.6481 3.1475 23.5245 13.4500 86.4080 5.6062 0.6540 3.2930 9.2837 5.1468 1.6111 9.8822 7.6955 2.2335 0.6776 1.2552 2.2954 4.3069 3.4457 1.0247 5.3706 1.9703 1.4460 4.4524 0.8900 20.4648 14.3646 9.0930 1.1643 4.9627 14.1139 13.1153 28.7303 2.1259 1.4480 0.7017 10.6053 4.1398 0.5661 1.3848 13.9458 5.8685 3.0222 6.6779 12.0822 14.1275 1.2757 19.4701 16.4010 30.8123 12.6608 3.5115 126.5653 56.8980 200.6406 17.3296 41.9406 4.4635 20.5116 93.6898 34.2899 36.4735 34.1818 56.5210 23.3100 4.3717 19.7543 20.1350 7.1637 4.5900 23.6116 2.0706 137.0708 23.6998 20.5755 62.8548 92.1536 72.0931 50.9751 17.5251 17.0625 2.7983 3.1084 2.9842
temp: 298.150 k
press: 1.00000 atm
elementType: 17 8 7 6 6 6 6 6 6 6 6 6 6 6 6 6 6 6 6 6 6 6 1 1 1 1 1 1 1 1 1 1 1 1 1 1 1 1 1 1 1 1 1 1 1 1 1 1 1 1 1 1 1 1
symmnumber: 1
zpe: 1233501.1 jmol-1
zpe.correction: 0.469816 hartree
zpe.thermalcorrener: 0.495601 hartree
zpe.thermalcorrenthalpy: 0.496545 hartree
zpe.thermalcorrgfe: 0.411422 hartree
zpe.sumelectzpe: -1331.489290 hartree
zpe.sumelectthermal: -1331.463506 hartree
zpe.sumelectthermalent: -1331.462561 hartree
zpe.sumelectthermalfe: -1331.547684 hartree
dipole: 2.0111 1.6929 1.9525
dipole: 3.2746
quadrupole: -133.8071 -143.5652 -147.0415
quadrupole: 5.0558 -1.9767 2.7027
quadrupole: 7.6641 -2.0939 -5.5702 5.0558 -1.9767 2.7027
hfenergy: -1331.9591062 hartree
pointgroup: C01 [X(C19H32Cl1N1O1)]
dipole: 0.7804626 0.858434 -0.560138 debye
polarizability: 254.129401|-2.7027442|183.8797492|-10.4564886|-23.515809|234.4487902 unknown
InChI: InChI=1S/C19H32ClNO/c1-4-6-8-12-21(13-9-7-5-2)15-19(22)17-11-10-16(3)18(20)14-17/h10-11,14,19,22H,4-9,12-13,15H2,1-3H3
charge 0 multiplicity 1
54 atoms
Cl -1.757582 -2.287152 2.125493
O  -0.772691 -0.120798 -3.861624
N  1.232435 1.181624 -0.912379
C  1.252647 2.515819 -0.246575
C  2.582667 0.572501 -1.050194
C  0.468973 1.185575 -2.174283
C  -0.059768 2.852284 0.495978
C  3.110858 -0.047752 0.260129
C  -0.213317 -0.179897 -2.497739
C  -0.266088 2.031883 1.787847
C  4.517115 -0.667621 0.096654
C  -1.358835 -0.504182 -1.554756
C  -1.651792 2.262893 2.431303
C  5.058211 -1.294581 1.401821
C  -1.096655 -1.16871 -0.333777
C  -2.686824 -0.116349 -1.851524
C  -1.829039 1.50662 3.766012
C  6.460997 -1.917026 1.23291
C  -2.156189 -1.419745 0.55458
C  -3.727905 -0.383823 -0.937069
C  -3.495666 -1.042157 0.300224
C  -4.622151 -1.320885 1.273086
H  2.08138 2.517639 0.485862
H  1.484461 3.321527 -0.988108
H  2.525754 -0.227458 -1.814022
H  3.326652 1.317195 -1.434474
H  1.120592 1.45744 -3.049405
H  -0.327406 1.94852 -2.122484
H  -0.055896 3.935215 0.740194
H  -0.923207 2.689902 -0.180918
H  3.14186 0.720915 1.057869
H  2.392513 -0.819029 0.601743
H  0.550465 -0.984805 -2.439818
H  -0.140504 0.957539 1.55461
H  0.527358 2.295311 2.519753
H  4.490742 -1.44515 -0.695966
H  5.227411 0.110208 -0.255475
H  -1.805496 3.350008 2.595965
H  -2.4358 1.940149 1.71576
H  5.08874 -0.517973 2.193078
H  4.347848 -2.069147 1.75553
H  -0.079132 -1.475972 -0.077125
H  -2.894123 0.368833 -2.809316
H  -0.072172 0.215691 -4.476995
H  -1.703208 0.417642 3.620248
H  -1.078784 1.835767 4.510206
H  -2.831735 1.678978 4.200208
H  6.450318 -2.716243 0.467744
H  7.196909 -1.155718 0.911445
H  6.824193 -2.359987 2.178379
H  -4.754132 -0.083963 -1.180358
H  -4.726082 -2.404051 1.468654
H  -4.434809 -0.840073 2.251155
H  -5.58141 -0.945427 0.879042
