program: Gaussian 09
title: 000226111
version: EM64L-G09RevD.01
frameworkgroup: C1[X(C7H12N4O3)]
method: RPBEPBE
basis: SDD
operation: Freq
keyword: #p
keyword: freq=noraman
keyword: PBEPBE/SDD
title: #p freq=noraman PBEPBE/SDD
converged: YES YES NO NO
title: Mulliken charges:
elementType: O O O N N N N C C C C C C C H H H H H H H H H H H H
charge: -0.227356 -0.227389 -0.227561 -0.087088 -0.669376 -0.359833 -0.359795 0.155960 -0.443852 0.112092 0.112091 -0.617622 -0.617658 0.203893 0.260896 0.260967 0.317334 0.317352 0.358991 0.359002 0.238809 0.215481 0.235063 0.238717 0.235560 0.215322
chargesum: 0.00000
title: Mulliken charges with hydrogens summed into heavy atoms:
elementType: O O O N N N N C C C C C C C
charge: -0.227356 -0.227389 -0.227561 -0.087088 -0.034690 -0.000842 -0.000793 0.155960 0.078011 0.112092 0.112091 0.071731 0.071941 0.203893
polarizability: 1.25564182e+02 -8.17536456e+00 1.09686592e+02 -1.33901412e-02 -3.35411021e-02 1.12288998e+02
1716.lowfreq: 0.0003 0.0008 0.0008 10.2650 12.0240 13.1614 45.1321 58.9337 93.7721
frequency: 45.0781 58.8336 93.7713 110.8202 140.5833 157.7945 178.8996 191.7596 201.0977 246.6101 273.8907 295.2020 319.1001 321.0707 368.0723 373.3152 419.9129 434.2539 471.9871 491.9560 522.2329 598.2077 629.9503 637.9348 649.6926 722.1661 729.9001 744.7295 757.4002 815.3543 858.0988 858.4244 976.4846 980.9563 1053.5252 1059.8673 1086.1371 1135.7998 1144.8613 1185.8753 1215.6395 1276.2102 1288.6141 1317.3996 1322.9709 1353.3276 1361.4337 1366.9347 1379.8527 1427.8280 1428.2619 1457.4660 1464.6619 1475.7003 1478.6088 1495.1192 1579.0636 1610.2456 1656.3922 1672.9665 2904.7447 2910.1080 2996.0105 3026.4075 3027.1843 3073.8060 3086.8365 3089.2998 3497.9150 3523.1224 3524.3763 3643.1306
redmass: 6.1794 3.9954 2.9409 3.0215 2.2851 4.0664 1.0483 3.4565 4.1870 3.0276 3.6482 3.4507 1.2105 5.1420 7.3265 4.6727 3.5793 1.8830 5.0185 6.9214 1.2819 9.9796 2.0510 3.8574 2.3686 3.8436 2.1308 4.6430 2.4105 5.6677 4.9999 2.3569 1.8768 3.4823 1.4671 1.9939 1.2393 1.3795 1.4034 4.1072 5.6767 1.6234 2.8918 2.6703 2.0823 1.8414 5.4796 1.4579 3.3456 1.0940 1.1411 1.1644 1.0468 1.0468 1.0501 1.0731 1.2737 7.1257 4.5625 5.1683 1.0507 1.0515 1.0584 1.0814 1.0810 1.1079 1.1013 1.1001 1.0437 1.0760 1.0783 1.1028
irintensity: 0.9523 0.0360 0.0015 2.1356 2.9939 0.1503 0.3228 1.3452 0.4682 7.0112 5.3599 0.0012 35.1073 32.0502 9.4587 6.2884 0.4265 0.3044 46.5356 16.5301 270.1712 0.2386 0.0145 1.7876 24.6781 113.1739 7.3998 9.0931 84.7054 47.1865 37.8003 8.6557 3.7240 13.1164 11.1892 101.8605 3.5869 5.7300 9.4424 10.6959 99.4231 80.5014 25.7050 53.2340 62.1587 52.3411 121.6703 6.4412 26.3143 19.6497 4.4057 3.8443 8.0801 16.1882 16.9573 28.8644 254.5529 401.1175 49.1172 527.1671 57.8927 216.4725 31.5066 27.2487 21.6192 0.9489 14.8795 33.2237 18.5375 72.5774 31.9529 38.9074
temp: 298.150 k
press: 1.00000 atm
elementType: 8 8 8 7 7 7 7 6 6 6 6 6 6 6 1 1 1 1 1 1 1 1 1 1 1 1
symmnumber: 1
zpe: 533972.6 jmol-1
zpe.correction: 0.203379 hartree
zpe.thermalcorrener: 0.217990 hartree
zpe.thermalcorrenthalpy: 0.218934 hartree
zpe.thermalcorrgfe: 0.162458 hartree
zpe.sumelectzpe: -717.568482 hartree
zpe.sumelectthermal: -717.553871 hartree
zpe.sumelectthermalent: -717.552927 hartree
zpe.sumelectthermalfe: -717.609403 hartree
dipole: -2.0180 -1.6261 -0.0051
dipole: 2.5916
quadrupole: -84.6358 -85.3296 -88.2058
quadrupole: 7.2981 0.0165 0.0069
quadrupole: 1.4213 0.7275 -2.1487 7.2981 0.0165 0.0069
hfenergy: -717.7718613 hartree
pointgroup: C01 [X(C7H12N4O3)]
dipole: -0.8571173 0.2671586 0.4832929 debye
dipolederiv: -0.3393269 -0.0849593 -0.1225564 0.1073786 -1.1566671 -0.360753 -0.0316628 -0.200861 -0.5676527 -0.442498 -0.1493559 0.0674034 -0.300359 -0.7433555 0.4836511 0.1659635 0.2884328 -0.8776267 -0.5855386 -0.0525423 -0.2885092 -0.0944981 -0.5280487 -0.0673808 -0.4809095 -0.0313536 -1.0903299 -0.3571255 -0.0150858 0.0250553 0.1036348 -0.5026296 -0.0817624 0.571321 -0.1807105 -0.8103909 -0.6450834 0.0325151 -0.1955965 0.0646833 -0.2779054 -0.0761066 -0.0474246 -0.1039761 -0.7681958 -0.5019025 -0.2911639 -0.2728272 -0.2145231 -0.751796 -0.2944039 -0.2908769 -0.4950609 -0.8515313 -0.3884587 0.0986281 -0.2495271 0.0362845 -0.5393292 0.23679 -0.1637214 0.4241378 -1.1773767 -0.5054608 0.0193951 0.0591293 0.0088241 -0.4196328 0.2196513 0.00992 0.2287696 0.5939415 0.6768189 -0.1759064 -0.1819412 -0.2653438 0.0381649 0.1758565 -0.590358 0.2519372 0.5992467 0.3141185 0.1115881 0.4083125 -0.2678632 1.3644085 0.3694057 0.4891628 0.2893889 0.8821209 0.5404553 0.2767952 0.1841571 0.6617819 0.7644587 -0.5009539 0.1279503 -0.42539 1.2559058 0.4116382 0.0818496 -0.0923758 0.2547519 0.1150291 -0.2329362 -0.2422004 -0.1291952 0.3068408 0.2497149 -0.1101127 0.0471697 -0.3363175 0.4494428 0.219348 -0.0460634 0.1605356 0.1313788 0.7961196 0.196211 0.3129503 0.245841 1.4254434 -0.0319673 0.5399393 -0.0743088 1.6033295 -0.0826585 -0.0449614 0.0202231 -0.065001 -0.0240141 -0.0761696 -0.0062266 -0.0329597 0.0504551 -0.0357151 0.0695107 0.026159 0.073978 -0.0158916 0.0863185 -0.0194222 0.0565551 -0.0049708 0.3319885 0.0368628 0.0970601 -0.0106408 0.1454444 -0.0362353 0.0179732 0.0397451 0.2513207 0.308129 -0.0495184 0.1302243 -0.0437706 0.1758023 0.0335117 0.0177254 -0.006329 0.2446904 0.3214728 -0.0411587 -0.037138 -0.0453418 0.1935555 -0.0340668 -0.0640918 -0.0252303 0.1620405 0.327361 -0.0214365 -0.0292906 -0.0288357 0.2130137 0.0257626 -0.0569036 0.0274002 0.1366255 0.069801 0.0633104 0.020107 0.0335488 -0.1025048 -0.0205124 0.0309981 -0.078026 0.076114 -0.3386461 -0.0417975 0.1223545 0.0098234 0.0613233 0.0464548 0.022688 0.0324832 0.0312092 0.0485719 -0.0316604 -0.0813363 -0.0343663 0.0978404 -0.0529807 0.0036712 0.0012094 -0.1392144 0.0285268 -0.0803119 0.0691741 -0.0454434 0.0032964 0.0486885 0.0853406 0.1010175 0.013838 0.0681919 0.0042041 -0.0872865 0.0390939 0.0608744 -0.0138961 -0.0345535 -0.0936293 -0.1238215 -0.2704943 0.1991009 0.0489051 0.1126803 -0.046323 -0.0653137 -0.0082387 -0.0245819 0.0720531 unknown
polarizability: 106.4987321|1.3178558|112.7614665|0.9301619|3.3185862|128.2795731 unknown
InChI: InChI=1S/C7H12N4O3/c1-11(2)3-7(8)4(12)9-6(14)10-5(7)13/h9-10H,3,8H2,1-2H3
charge 0 multiplicity 1
26 atoms
O  0.135844 -2.651575 -0.951702
O  0.983278 1.855798 -1.933288
O  1.658356 0.231319 2.395966
N  -1.668144 0.498794 0.754027
N  -0.335606 -0.50262 -2.696786
N  0.857066 -1.212677 0.735368
N  1.284501 1.065357 0.239884
C  -0.13169 -0.235644 -1.294822
C  -1.608543 0.181023 -0.65342
C  0.317731 -1.475549 -0.531016
C  0.776052 0.965767 -1.062536
C  -2.312407 -0.4757 1.650427
C  -1.862826 1.908795 1.131651
C  1.254973 0.05121 1.219815
H  -2.234825 -0.68969 -0.920308
H  -1.913546 1.027936 -1.294837
H  -0.273802 -1.484861 -2.968712
H  0.044297 0.197585 -3.335449
H  1.010692 -2.001844 1.370819
H  1.750367 1.936232 0.513198
H  -2.029265 -1.502364 1.362122
H  -3.424913 -0.40727 1.6324
H  -1.975585 -0.309419 2.690013
H  -1.280667 2.565182 0.462767
H  -1.506017 2.074018 2.164809
H  -2.930522 2.2248 1.079212
