program: Gaussian 09
title: 000224830
version: EM64L-G09RevD.01
frameworkgroup: C1[X(C12H12O4)]
method: RPBEPBE
basis: SDD
operation: Freq
keyword: #pfreq=noraman
keyword: PBEPBE/SDD
title: #p freq=noraman PBEPBE/SDD
converged: YES YES NO NO
title: Mulliken charges:
elementType: O O O O C C C C C C C C C C C C H H H H H H H H H H H H
charge: -0.223169 -0.290302 -0.250842 -0.439591 -0.552707 0.161825 -0.302175 -0.352271 0.526445 0.155963 -0.554852 -0.391385 0.211554 0.180716 -0.383855 -0.521753 0.240759 0.247285 0.225965 0.230994 0.216243 0.251277 0.320675 0.220498 0.365516 0.263512 0.211987 0.231689
chargesum: 0.00000
title: Mulliken charges with hydrogens summed into heavy atoms:
elementType: O O O O C C C C C C C C C C C C
charge: -0.223169 -0.290302 -0.250842 -0.074075 -0.064662 0.161825 0.154784 -0.136028 0.526445 0.155963 -0.303575 -0.070711 0.211554 0.180716 -0.163357 0.185435
polarizability: 2.81773326e+02 -1.36548046e+01 1.44775365e+02 -1.90025025e-01 1.66965642e+00 7.22622620e+01
1716.lowfreq: -7.2998 -2.1618 -0.0013 -0.0007 -0.0007 2.3914 37.3085 50.3743 61.2307
frequency: 37.2254 50.3620 61.1920 103.3097 112.3267 123.8652 168.6889 173.5347 199.0879 248.2038 257.2356 277.2576 330.0003 358.5453 379.7570 400.0883 410.8705 462.1650 484.0063 562.3622 575.8815 625.8701 650.9925 663.2689 710.0290 718.4397 733.2427 736.2023 791.0001 820.9290 842.4137 882.8798 894.3160 932.4393 943.6013 982.6590 989.9396 1000.1460 1019.7602 1056.4308 1084.3809 1113.1591 1153.7628 1154.3666 1168.3715 1172.5927 1184.0801 1199.6186 1236.7533 1268.7441 1281.3010 1313.7560 1338.7019 1364.2875 1409.3503 1420.8243 1441.0038 1455.6815 1459.1504 1480.0474 1485.8487 1503.2158 1578.5025 1601.9442 1635.4239 1658.9176 2976.5438 2989.3643 3018.4652 3064.0550 3067.8328 3086.6671 3107.5746 3109.8346 3130.1725 3142.8736 3160.3712 3574.0247
redmass: 4.3648 4.6572 2.1494 2.9602 5.2115 1.8503 3.5428 2.5789 7.6862 3.7754 5.2671 5.1297 4.5785 3.3742 1.2275 3.5004 5.8107 3.3282 6.2269 6.8440 5.2256 4.1398 5.2501 4.0243 6.4673 5.6220 4.8931 4.6641 6.0017 1.3904 1.7272 1.4820 5.0866 2.5876 1.8448 4.9883 1.3189 3.6358 3.9616 1.6290 2.5210 1.2412 2.9202 1.4304 1.2622 1.4679 1.3376 1.3305 1.9917 3.1375 1.3842 1.8089 1.3248 2.3229 4.1823 1.5310 1.4615 1.0613 1.0889 1.0542 1.0893 2.9286 6.2170 6.8762 8.2390 9.5467 1.0350 1.0648 1.0639 1.0907 1.0934 1.0970 1.1057 1.0902 1.1048 1.0913 1.0965 1.0659
irintensity: 0.8864 9.5824 4.0065 0.3146 8.1603 5.4089 6.2682 1.1692 1.3212 5.3669 0.8840 1.6848 10.2510 17.2851 128.3234 0.2795 0.9050 5.6670 0.4540 28.9061 5.8203 5.1382 1.5780 4.8751 11.5027 9.3446 4.6919 12.7844 12.2394 37.3520 12.4238 13.8869 65.4477 26.8175 30.1875 122.6411 9.0467 160.9972 248.4260 9.2157 82.7428 7.0590 223.4989 5.1727 70.4369 55.7645 16.0195 9.2702 88.4593 274.4591 52.3857 5.4912 0.1410 6.6203 9.8001 70.1774 6.4066 18.0193 9.0100 33.7824 3.9915 103.5175 135.2100 82.2225 130.6859 156.7403 91.3388 24.8018 70.5523 5.7593 36.5218 37.6948 33.3047 17.7080 16.6097 3.6454 46.0168 70.8380
temp: 298.150 k
press: 1.00000 atm
elementType: 8 8 8 8 6 6 6 6 6 6 6 6 6 6 6 6 1 1 1 1 1 1 1 1 1 1 1 1
symmnumber: 1
zpe: 564410.6 jmol-1
zpe.correction: 0.214973 hartree
zpe.thermalcorrener: 0.229870 hartree
zpe.thermalcorrenthalpy: 0.230815 hartree
zpe.thermalcorrgfe: 0.172127 hartree
zpe.sumelectzpe: -764.168754 hartree
zpe.sumelectthermal: -764.153856 hartree
zpe.sumelectthermalent: -764.152912 hartree
zpe.sumelectthermalfe: -764.211599 hartree
dipole: -1.5954 -2.7151 1.1616
dipole: 3.3565
quadrupole: -82.3658 -86.3975 -94.8837
quadrupole: -25.8285 -6.4902 -2.1636
quadrupole: 5.5165 1.4848 -7.0014 -25.8285 -6.4902 -2.1636
hfenergy: -764.3837262 hartree
pointgroup: C01 [X(C12H12O4)]
dipole: 0.5795247 -0.2710265 -1.1552338 debye
polarizability: 276.4021872|-32.4976639|97.5543406|17.6967515|29.2772179|124.8544253 unknown
InChI: InChI=1S/C12H12O4/c1-15-11-7-8(2-3-10(11)13)6-9-4-5-16-12(9)14/h2-3,6-7,13H,4-5H2,1H3
charge 0 multiplicity 1
28 atoms
O  -4.413876 1.454201 0.585982
O  3.231259 -1.716053 -0.948606
O  -2.4553 1.505945 1.813019
O  3.946324 -0.232041 1.427437
C  -3.908312 -0.237433 -1.06104
C  -2.656353 0.110829 -0.258314
C  -4.876033 0.921486 -0.7282
C  -1.418996 -0.418389 -0.55342
C  -0.076778 -0.289257 0.022832
C  -3.06471 1.059325 0.816517
C  0.975459 -0.96682 -0.665916
C  0.261576 0.447919 1.19807
C  2.311376 -0.939217 -0.226698
C  2.620863 -0.213306 0.962092
C  1.592228 0.477868 1.646695
C  4.526325 -1.101276 -1.312304
H  -3.717812 -0.320324 -2.144434
H  -4.330053 -1.201343 -0.716128
H  -4.813571 1.744793 -1.462329
H  -5.924605 0.613021 -0.600123
H  -1.430862 -1.088192 -1.429165
H  0.766202 -1.543842 -1.573991
H  -0.520025 0.976614 1.74905
H  1.840024 1.036936 2.559556
H  4.020231 0.265368 2.279954
H  5.111862 -0.846459 -0.414738
H  4.362839 -0.195583 -1.928003
H  5.041814 -1.869568 -1.908097
