program: Gaussian 09
title: 000223265
version: EM64L-G09RevD.01
frameworkgroup: C1[X(C8H7N3O3)]
method: RPBEPBE
basis: SDD
operation: Freq
keyword: #pfreq=noraman
keyword: PBEPBE/SDD
title: #p freq=noraman PBEPBE/SDD
converged: YES YES NO NO
title: Mulliken charges:
elementType: O O O N N N C C C C C C C C H H H H H H H
charge: -0.208220 -0.187596 -0.199144 -0.409368 0.006660 -0.003167 0.294727 0.106099 0.300548 0.070014 0.048713 -0.761556 -0.744674 -0.226094 0.351510 0.279807 0.256956 0.247335 0.289277 0.216040 0.272133
chargesum: 0.00000
title: Mulliken charges with hydrogens summed into heavy atoms:
elementType: O O O N N N C C C C C C C C
charge: -0.208220 -0.187596 -0.199144 -0.057858 0.006660 -0.003167 0.294727 0.106099 0.300548 0.070014 0.048713 0.022542 0.032776 -0.226094
polarizability: 1.84194634e+02 -1.57713985e-01 1.39335213e+02 2.52804821e+00 3.73229185e+00 6.01539240e+01
1716.lowfreq: -5.1611 -0.0004 -0.0003 0.0009 6.7644 7.6461 66.4725 70.0096 89.3379
frequency: 66.4709 70.0028 89.3354 133.0427 162.5555 170.1609 179.2990 227.8252 236.2733 260.6950 316.8059 328.8134 354.8403 406.1513 433.9085 462.9334 487.5218 544.5376 563.7035 596.3638 624.4509 667.9244 701.2816 723.8148 751.7449 796.1394 817.4124 974.3701 1033.7308 1039.5106 1041.4699 1058.7317 1066.0182 1146.3906 1219.7271 1257.1150 1281.4843 1344.0038 1390.3796 1402.0693 1407.3898 1432.8244 1446.9828 1460.9272 1470.3407 1478.8492 1534.6493 1575.3593 1642.9412 2182.0701 3004.5550 3006.2955 3087.9773 3097.0096 3109.3065 3119.0112 3493.3077
redmass: 8.8773 6.8066 5.9715 7.9389 2.9534 1.0498 1.2570 4.3432 7.9870 8.9436 4.8655 4.8647 4.2931 6.0813 7.7357 8.2980 5.6804 5.6161 3.9683 5.7664 8.0276 4.7338 6.8283 7.8414 2.5252 2.0099 4.7403 3.2354 1.7553 1.5852 1.8201 1.7237 4.8361 8.0465 12.0980 7.9940 2.2928 8.8211 3.5620 1.2081 1.2305 1.5618 1.1811 1.4468 1.1174 1.2550 4.8838 4.9764 6.3410 12.6279 1.0373 1.0373 1.0962 1.0985 1.0995 1.1010 1.0775
irintensity: 2.6784 9.2811 1.6490 3.3218 0.1688 1.0324 1.6742 0.5053 9.0026 3.0551 0.2692 0.8688 0.5991 2.8623 4.4024 0.5383 1.7985 3.0148 1.3718 4.4419 9.8745 1.4231 9.1826 13.2163 13.1329 70.4105 4.5411 5.2126 3.8298 12.3266 3.9941 0.7387 36.4030 3.2510 257.4929 77.1314 14.4810 110.8690 72.7225 34.3105 21.7027 34.3047 27.4705 23.9377 5.8314 14.7487 53.4331 106.8739 461.2481 12.0884 8.8124 1.0795 3.8182 7.4606 9.2576 6.4137 67.7195
temp: 298.150 k
press: 1.00000 atm
elementType: 8 8 8 7 7 7 6 6 6 6 6 6 6 6 1 1 1 1 1 1 1
symmnumber: 1
zpe: 382678.2 jmol-1
zpe.correction: 0.145754 hartree
zpe.thermalcorrener: 0.158738 hartree
zpe.thermalcorrenthalpy: 0.159682 hartree
zpe.thermalcorrgfe: 0.106345 hartree
zpe.sumelectzpe: -697.888028 hartree
zpe.sumelectthermal: -697.875044 hartree
zpe.sumelectthermalent: -697.874100 hartree
zpe.sumelectthermalfe: -697.927437 hartree
dipole: 4.4216 3.3645 -0.0696
dipole: 5.5566
quadrupole: -115.7723 -72.9538 -79.9707
quadrupole: 10.1825 -0.8279 -1.9854
quadrupole: -26.2067 16.6118 9.5949 10.1825 -0.8279 -1.9854
hfenergy: -698.0337821 hartree
pointgroup: C01 [X(C8H7N3O3)]
dipole: 1.77413 1.2772685 0.0125815 debye
dipolederiv: -0.8973111 0.4606747 -0.0068775 0.4767829 -0.7815679 0.012113 -0.0103309 0.0104075 -0.3431431 -0.4645291 0.1322153 0.0030669 0.2533462 -0.7619147 -0.2578847 0.013169 -0.2836959 -0.3883388 -0.9131009 0.0226215 -0.2144086 -0.1197403 -0.3516966 -0.1367623 -0.2410647 -0.1367751 -0.3864536 -0.8533882 0.5611359 -0.0006238 -0.1703809 -0.4093388 0.0032874 -0.0000825 -0.0007167 -0.2532458 1.566769 -0.5039607 0.2538635 -0.5097913 0.9854409 0.4837579 0.283655 0.4576927 0.5634483 -0.2885682 -0.0455249 0.0033031 -0.0713083 -0.2392892 0.0042697 0.0050983 0.0003445 -0.2286019 0.8527004 0.0051107 -0.0098787 0.0175125 0.4823595 -0.0109463 0.1004785 -0.0585963 0.0580083 -0.7726271 0.1517289 -0.0247792 -0.0148029 -0.8104725 -0.0480971 -0.0444514 -0.0352674 -0.1070473 0.393505 -0.3147856 0.0085031 0.048653 1.0529882 -0.003705 -0.091673 0.1149972 0.1410307 -0.329613 0.0694652 0.0036047 0.5235203 -0.4344289 0.0112233 0.0226701 -0.0000604 0.041829 1.2374733 -0.587118 0.0097255 -0.4642226 0.9418955 -0.0202912 0.0104858 -0.0216419 0.2293771 -0.0022415 0.0713816 -0.0188581 0.0253498 -0.2951738 -0.0195659 0.0089282 -0.071137 0.0179808 -0.2383642 -0.2029706 0.0049324 -0.1210964 0.0424942 -0.0445164 -0.0703047 -0.1071041 0.0096906 0.2093196 0.1234184 -0.0086597 0.1136003 0.0406433 -0.0030642 -0.0176602 0.015834 0.0375563 0.1561023 0.0020983 -0.0007733 -0.0280667 0.2449716 0.002021 0.0123289 0.0018477 0.3036436 0.1239985 0.0203304 0.0549269 0.0152561 0.0912306 -0.0143698 0.0232842 -0.0167776 0.0063213 -0.0409497 -0.0903856 0.0441962 -0.0111882 0.0880486 0.0081022 0.0287261 0.0379858 0.1071523 0.0341537 0.0255375 -0.0984364 0.0087263 0.0853409 0.0131304 -0.0870028 0.0381786 0.0273272 0.0982979 -0.0310226 -0.0312349 -0.0204416 0.0841139 0.0357157 -0.0182948 0.0018407 0.0077719 0.0632959 0.1141524 -0.0264408 0.0014204 -0.1030058 0.0499218 0.0133375 0.0771984 0.1056047 0.0650774 0.0158971 0.0548486 0.0468715 0.047361 -0.0643396 0.0587033 -0.0245549 0.0500886 unknown
polarizability: 184.1450606|-1.4346664|139.0982262|2.8049065|5.9383349|60.4404843 unknown
InChI: InChI=1S/C8H7N3O3/c1-4-6(3-9)8(12)10-5(2)7(4)11(13)14/h10H,1-2H3
charge 0 multiplicity 1
21 atoms
O  -2.452236 2.08871 -0.051169
O  2.3879 -1.932843 -0.762296
O  3.306776 -0.373041 0.625416
N  -0.129241 1.930771 -0.03396
N  2.310769 -0.855922 -0.05059
N  -3.755034 -1.319732 0.049252
C  -0.213965 -0.867489 -0.010939
C  1.03351 -0.134297 -0.016783
C  1.073612 1.273151 -0.013813
C  -1.411058 -0.128166 -0.007999
C  -1.43756 1.340187 -0.033896
C  -0.255046 -2.378157 0.035797
C  2.311829 2.135528 -0.012741
C  -2.688476 -0.779496 0.02428
H  -0.14045 2.957363 -0.054118
H  0.023975 -2.802013 -0.944335
H  -1.262691 -2.731921 0.301825
H  0.471635 -2.782896 0.760983
H  2.76912 2.149938 0.99111
H  2.065655 3.16891 -0.312884
H  3.083879 1.741616 -0.692842
