program: Gaussian 09
title: 000221879
version: EM64L-G09RevD.01
frameworkgroup: C1[X(C8H13BrO3)]
method: RPBEPBE
basis: SDD
operation: Freq
keyword: #p
keyword: freq=noraman
keyword: PBEPBE/SDD
title: #p freq=noraman PBEPBE/SDD
converged: NO YES NO NO
title: Mulliken charges:
elementType: Br O O O C C C C C C C C H H H H H H H H H H H H H
charge: -0.022093 -0.271688 -0.258116 -0.236450 -0.037711 -0.458868 -0.473880 -0.293564 -0.356608 0.271077 -0.458022 -0.654193 0.258915 0.228151 0.244454 0.226332 0.236922 0.224526 0.202862 0.262385 0.232909 0.268919 0.273205 0.295614 0.294924
chargesum: 0.00000
title: Mulliken charges with hydrogens summed into heavy atoms:
elementType: Br O O O C C C C C C C C
charge: -0.022093 -0.271688 -0.258116 -0.236450 0.221204 0.013737 -0.010627 0.133824 0.138687 0.271077 0.084102 -0.063656
polarizability: 1.55095252e+02 7.12893856e+00 9.23358745e+01 2.11370319e+00 -4.32908647e+00 7.75577659e+01
1716.lowfreq: -8.0645 -3.8263 0.0010 0.0010 0.0011 12.1904 24.1052 27.6678 33.0320
frequency: 23.8263 27.4677 32.9665 43.6973 73.0870 95.2918 113.9966 178.5146 201.8645 252.6136 285.5377 308.8006 407.1554 468.7928 553.1734 585.5673 594.9410 667.2454 687.0673 762.7343 817.1213 821.6727 846.5851 860.8246 891.2447 915.6613 929.6873 961.0751 990.1602 997.3038 1026.3669 1074.8242 1086.8691 1123.0914 1126.9797 1131.3284 1149.1676 1171.4669 1218.6174 1228.9399 1238.4127 1261.9149 1269.8926 1300.4801 1312.6878 1323.9719 1333.1749 1345.2041 1367.0007 1444.2410 1446.8708 1454.7114 1466.2475 1473.8827 1490.8150 1635.4974 2979.9494 3013.2479 3014.2422 3018.1303 3036.0104 3044.2977 3070.0840 3071.1578 3078.2101 3080.3891 3093.9713 3124.7657 3163.9398
redmass: 5.3289 2.3617 3.8774 5.5936 3.5639 3.8996 5.2946 5.5768 3.1055 2.8635 4.1511 4.6786 2.0377 6.0905 2.7983 2.0340 5.6297 4.3598 5.4183 1.2576 2.3307 3.1562 3.8901 2.4863 1.7318 2.6267 5.8551 1.4712 1.5040 2.5536 3.4795 4.0395 1.4924 1.2460 2.4221 1.6604 1.4383 1.7854 1.2817 1.2450 1.3131 1.1491 1.2307 1.3902 1.2451 1.4637 1.3695 1.4032 1.3870 1.1017 1.0873 1.1005 1.0852 1.0932 1.0936 9.1440 1.0655 1.0607 1.0668 1.0611 1.0827 1.0595 1.0990 1.1001 1.0571 1.1020 1.1055 1.1097 1.1112
irintensity: 0.6356 0.5977 0.6639 0.7967 4.4852 1.8906 0.9280 1.2602 4.4333 13.8751 11.6735 11.6165 7.2564 12.9631 2.0663 5.3759 44.1263 10.0227 6.8688 15.7475 4.9299 19.5055 14.0256 1.2329 8.1290 13.2466 68.1964 0.4858 0.5929 26.7440 94.1266 33.3948 9.6843 14.4245 253.4149 70.8080 7.3858 6.8340 12.7563 28.5709 5.8507 0.7286 0.1486 8.7368 2.1073 84.8301 33.8645 11.3132 15.8655 39.2495 10.0021 7.8534 10.1801 11.4940 0.8768 165.0835 87.6645 20.8235 15.9571 10.0377 16.4761 35.3058 30.3629 2.3951 7.0074 12.7227 54.2650 11.5724 4.6745
temp: 298.150 k
press: 1.00000 atm
elementType: 35 8 8 8 6 6 6 6 6 6 6 6 1 1 1 1 1 1 1 1 1 1 1 1 1
symmnumber: 1
zpe: 530464.4 jmol-1
zpe.correction: 0.202043 hartree
zpe.thermalcorrener: 0.215404 hartree
zpe.thermalcorrenthalpy: 0.216348 hartree
zpe.thermalcorrgfe: 0.157245 hartree
zpe.sumelectzpe: -550.816035 hartree
zpe.sumelectthermal: -550.802674 hartree
zpe.sumelectthermalent: -550.801730 hartree
zpe.sumelectthermalfe: -550.860833 hartree
dipole: 2.7624 -2.6749 0.7421
dipole: 3.9162
quadrupole: -82.8319 -86.4890 -79.4339
quadrupole: -11.5121 1.2107 3.5662
quadrupole: 0.0864 -3.5707 3.4843 -11.5121 1.2107 3.5662
hfenergy: -551.0180782 hartree
pointgroup: C01 [X(C8H13Br1O3)]
dipole: -1.3133491 0.4316247 -0.6802448 debye
dipolederiv: -0.4597485 -0.0216037 0.1402095 -0.0756161 -0.1538448 0.0485542 0.2279104 0.0293369 -0.2560597 -1.0544233 -0.1019317 0.004393 -0.1103716 -0.3851313 0.0624919 0.0257967 0.0236599 -0.4409601 -1.8178061 0.1401047 0.1383839 0.3100205 -0.4574372 0.0610079 0.1234813 0.0794312 -0.4078177 -0.805343 0.0208899 0.1080903 0.3374369 -0.5435466 0.2205962 -0.2204587 0.2934773 -0.5956871 0.6286489 0.0537725 -0.0203278 0.2248729 0.292841 -0.0282327 -0.0864725 -0.0488458 0.2391468 -0.0574652 0.0359913 -0.0274103 0.0123179 0.0749304 0.0762614 -0.0050853 0.0397961 -0.0818182 -0.0406106 0.0313516 0.0673646 0.0114203 0.0870103 0.0535589 -0.00659 0.0825822 -0.0462826 0.7240354 0.0685244 0.0078061 -0.0418123 0.3022393 0.0255408 0.2675908 0.0817564 0.264745 0.7521477 0.0213075 -0.093163 0.0530444 0.1876364 -0.0138967 -0.3539726 0.0098317 0.2354897 1.8592102 -0.2207347 -0.2142123 -0.671154 0.6519652 -0.379183 0.1036693 -0.4403991 0.7220841 -0.2173578 -0.0023067 0.1094942 -0.1812343 -0.0072566 0.2015939 0.3733463 0.1273868 -0.1944632 0.6032742 0.1087273 -0.3109181 0.1375714 0.1354968 -0.0905356 -0.375747 -0.0769556 0.3568135 -0.0689632 0.0754531 0.0085884 0.1003407 -0.054709 -0.0197387 -0.0077031 -0.0052553 0.0373416 0.0224913 -0.0168444 -0.0376288 -0.0111606 -0.0979336 -0.1201914 -0.0345849 -0.0844604 0.0147232 0.0431769 -0.0561424 0.1011568 -0.0670317 0.0253932 0.077167 0.1126414 0.0503126 0.017982 0.0791803 -0.0444335 0.025293 -0.0059072 -0.1560358 -0.0255467 0.0256718 -0.0565474 0.0491046 -0.0444064 0.0044589 -0.1268434 -0.0187718 0.0885862 -0.0132334 -0.1436226 0.0022654 -0.0303922 -0.0918239 0.0449905 0.0728477 0.1047295 0.0315256 -0.0781888 0.1050385 -0.0573277 -0.0239191 -0.1006387 -0.0856159 -0.026034 -0.1456607 -0.140649 -0.0249223 -0.1179533 -0.0630474 0.0345125 -0.0046685 -0.011823 -0.0757469 -0.0451573 0.0919766 0.0387364 0.0094193 -0.0110324 -0.0475145 -0.0472583 0.0805658 0.0438137 0.0641541 -0.0512715 -0.0056794 0.0381569 0.0338645 0.0952759 0.0366657 -0.0210952 -0.0429339 0.0160194 0.103967 -0.044515 -0.0845988 -0.0164796 -0.0127676 0.0648919 -0.0055217 0.0287633 0.0335618 -0.0462843 -0.0203909 -0.0184438 -0.0195899 0.1128641 -0.0082539 -0.0296357 0.0536177 -0.0218098 0.0818015 -0.0037422 -0.0113722 -0.0028349 -0.0869372 0.0050449 -0.068449 0.0653962 -0.0098024 -0.0612698 0.0024882 0.0538819 0.0290746 0.044536 unknown
polarizability: 148.5007751|4.7036427|81.0054129|-19.9922971|-9.1864747|95.4827048 unknown
InChI: InChI=1S/C8H13BrO3/c9-4-3-8(10)12-6-7-2-1-5-11-7/h7H,1-6H2
charge 0 multiplicity 1
25 atoms
Br 5.218216 0.574911 -1.670271
O  -2.862605 -0.795304 1.405444
O  0.222172 0.925579 0.102683
O  1.548578 -0.606556 1.267636
C  -1.742062 -0.585815 0.446813
C  -2.392476 -0.340705 -0.934759
C  -3.783252 0.246372 -0.574824
C  -4.149063 -0.542196 0.698774
C  -0.942824 0.614967 0.989569
C  1.409778 0.240201 0.35567
C  2.488799 0.681337 -0.627019
C  3.812437 -0.0334 -0.341864
H  -1.107491 -1.489852 0.466368
H  -2.510442 -1.298586 -1.472669
H  -1.785215 0.335449 -1.560006
H  -3.70681 1.32716 -0.357185
H  -4.522795 0.110461 -1.381727
H  -4.803322 0.007845 1.395997
H  -4.615442 -1.516413 0.449382
H  -0.581397 0.397136 2.008436
H  -1.545939 1.536241 0.978629
H  2.140088 0.473989 -1.655285
H  2.606102 1.777929 -0.558637
H  4.219892 0.208278 0.64931
H  3.742077 -1.122833 -0.465265
