program: Gaussian 09
title: 000221658
version: EM64L-G09RevD.01
frameworkgroup: C1[X(C12H16O3)]
method: RPBEPBE
basis: SDD
operation: Freq
keyword: #pfreq=noraman
keyword: PBEPBE/SDD
title: #p freq=noraman PBEPBE/SDD
converged: NO YES NO NO
title: Mulliken charges:
elementType: O O O C C C C C C C C C C C C H H H H H H H H H H H H H H H H
charge: -0.457017 -0.271710 -0.265638 -0.432438 -0.239164 -0.352525 0.558948 -0.368511 -0.560517 -0.371668 0.197484 0.162190 -0.330748 -0.691798 -0.202896 0.237730 0.177449 0.196591 0.187273 0.217837 0.203064 0.190415 0.255847 0.264521 0.247413 0.219922 0.214498 0.212749 0.331620 0.238480 0.230599
chargesum: 0.00000
title: Mulliken charges with hydrogens summed into heavy atoms:
elementType: O O O C C C C C C C C C C C C
charge: -0.125397 -0.271710 -0.265638 -0.017260 -0.042573 0.052585 0.558948 0.024968 -0.304670 -0.107147 0.197484 0.162190 -0.083335 -0.044629 0.266183
polarizability: 1.74009225e+02 -2.42663865e+01 1.17591795e+02 5.87641088e+00 1.15405752e+01 1.19786679e+02
1716.lowfreq: -0.0008 -0.0007 -0.0002 2.7642 9.2603 16.2513 27.2966 31.5219 45.0100
frequency: 27.1682 31.2731 44.9146 53.3280 106.0987 131.8485 160.4414 185.6810 201.1986 226.3474 262.0845 285.2191 297.2089 320.2313 383.3217 398.5159 419.8701 446.2363 487.7109 553.5926 623.5889 626.8915 678.4537 713.5568 723.5078 751.3668 775.1467 798.2243 825.3530 840.3832 863.8369 877.0897 884.2581 941.1450 944.7894 971.2068 976.6553 984.9065 1020.1406 1055.2519 1069.0469 1094.2637 1104.6962 1112.0847 1123.1399 1131.4919 1160.1717 1186.7563 1205.9869 1245.4979 1251.5467 1273.9835 1281.1006 1290.3755 1313.9398 1340.8886 1353.0975 1364.0465 1375.8080 1390.9949 1410.4842 1440.8643 1453.0786 1470.0806 1472.1694 1480.5879 1481.3485 1488.5035 1488.8131 1611.1381 1630.8364 2935.3147 2943.2562 2958.7414 2970.2650 2977.8623 3001.0139 3014.2058 3025.3299 3046.9877 3071.3871 3077.9122 3094.6473 3160.6359 3162.2604 3182.7199 3544.3306
redmass: 3.6254 3.7218 2.3335 3.1214 2.9163 3.7852 1.9536 4.0596 2.6227 3.8545 1.8653 2.2439 3.3337 1.4138 3.1946 5.1375 3.0294 4.1973 2.8627 5.8978 5.0371 3.4231 8.8107 3.5486 3.8827 1.2543 6.4997 1.3644 1.4278 7.0123 3.3969 1.4633 2.7687 1.4540 1.4769 6.4252 1.7743 4.1829 2.2755 3.4402 1.4780 2.2879 1.8425 1.9161 1.0528 1.3929 1.5112 1.3735 1.3952 2.0311 1.7022 1.3611 1.2174 1.1650 1.2247 1.4891 1.4891 1.2928 2.0413 1.2273 2.6093 3.7794 1.1253 1.0731 1.1275 1.0557 1.6213 1.1171 1.4944 7.7894 8.3267 1.0829 1.0672 1.0617 1.0611 1.0371 1.0582 1.0967 1.0965 1.0994 1.0995 1.0995 1.1133 1.0925 1.0886 1.0968 1.0658
irintensity: 0.2266 0.0749 13.2199 2.4124 0.5602 0.3409 1.2168 2.2097 2.1411 0.6913 9.3837 19.4901 14.6261 103.0146 2.2987 8.8156 7.4590 2.3405 11.0758 8.4778 4.9911 12.4429 1.4989 6.2276 3.4773 19.9772 19.5996 5.6302 42.5976 36.2771 10.7091 28.7359 7.7965 14.2904 2.7694 161.5606 1.5640 22.2150 5.2606 14.0298 5.6991 3.6458 3.8768 4.2975 0.2566 13.6414 25.2435 23.2301 68.7657 108.6095 78.8836 13.0157 2.8144 5.2676 12.7047 0.7998 3.8865 1.6940 16.3515 16.5176 25.0270 74.8529 10.6410 7.8611 3.5530 12.8666 51.0160 37.1775 26.4080 4.4213 0.6558 39.0604 53.1922 38.4493 51.9116 20.0081 126.5851 14.7706 18.1975 66.5833 61.4861 59.9329 35.4223 3.7530 3.0239 3.9223 5.8829
temp: 298.150 k
press: 1.00000 atm
elementType: 8 8 8 6 6 6 6 6 6 6 6 6 6 6 6 1 1 1 1 1 1 1 1 1 1 1 1 1 1 1 1
symmnumber: 1
zpe: 670876.2 jmol-1
zpe.correction: 0.255523 hartree
zpe.thermalcorrener: 0.270670 hartree
zpe.thermalcorrenthalpy: 0.271614 hartree
zpe.thermalcorrgfe: 0.211334 hartree
zpe.sumelectzpe: -691.367755 hartree
zpe.sumelectthermal: -691.352609 hartree
zpe.sumelectthermalent: -691.351665 hartree
zpe.sumelectthermalfe: -691.411944 hartree
dipole: -1.7875 -1.5210 -0.4728
dipole: 2.3942
quadrupole: -77.4935 -92.3105 -89.6648
quadrupole: -8.1492 1.5605 0.2198
quadrupole: 8.9961 -5.8209 -3.1752 -8.1492 1.5605 0.2198
hfenergy: -691.6232782 hartree
pointgroup: C01 [X(C12H16O3)]
dipole: 0.7030383 -0.4738074 0.4104927 debye
polarizability: 173.3769866|25.7674039|110.5985647|-2.7496097|-7.0894985|127.412148 unknown
InChI: InChI=1S/C12H16O3/c1-2-3-4-10(13)9-5-6-11-12(7-9)15-8-14-11/h5-7,10,13H,2-4,8H2,1H3
charge 0 multiplicity 1
31 atoms
O  1.696755 2.746469 -0.777774
O  -2.851785 -0.545162 1.493871
O  -3.556202 -0.827806 -0.785971
C  2.71656 0.61104 -0.020185
C  1.539494 1.607748 0.155426
C  2.697209 -0.559916 0.989297
C  0.180828 0.987776 -0.140176
C  3.954338 -1.461607 0.922957
C  -0.644633 0.547839 0.934472
C  -0.241448 0.81943 -1.482322
C  -1.857551 -0.059391 0.603484
C  -2.270822 -0.22571 -0.733977
C  -1.484802 0.211195 -1.803665
C  4.119618 -2.209749 -0.419249
C  -3.886726 -1.165442 0.623954
H  2.69349 0.23198 -1.059328
H  3.670593 1.17029 0.104731
H  1.55026 1.979895 1.204229
H  2.605875 -0.147799 2.016614
H  1.79329 -1.176764 0.817728
H  3.900326 -2.203392 1.744572
H  4.857524 -0.846749 1.116931
H  -0.34722 0.687021 1.978012
H  0.398041 1.20357 -2.282069
H  -1.817945 0.095973 -2.838208
H  4.27669 -1.510977 -1.260918
H  4.987279 -2.894136 -0.388014
H  3.220529 -2.813267 -0.646648
H  2.624125 3.088945 -0.696554
H  -4.869874 -0.735598 0.874623
H  -3.851914 -2.263807 0.749653
