program: Gaussian 09
title: 000222983
version: EM64L-G09RevD.01
frameworkgroup: C1[X(C18H21NO3)]
method: RPBEPBE
basis: SDD
operation: Freq
keyword: #p
keyword: freq=noraman
keyword: PBEPBE/SDD
title: #p freq=noraman PBEPBE/SDD
converged: YES YES NO NO
title: Mulliken charges:
elementType: O O O N C C C C C C C C C C C C C C C C C C H H H H H H H H H H H H H H H H H H H H H
charge: -0.284436 -0.284442 -0.278278 -0.373538 -0.343050 -0.405544 0.548317 0.411478 -0.518269 -0.512067 -0.370641 -0.422589 0.237141 -0.333727 0.167810 -0.239437 -0.245822 -0.246379 0.229362 -0.774423 -0.536965 -0.520611 0.238664 0.263109 0.215204 0.258640 0.253436 0.321096 0.242358 0.250838 0.253957 0.225838 0.225791 0.229153 0.252047 0.214583 0.251282 0.228386 0.226875 0.245003 0.210746 0.258795 0.230309
chargesum: 0.00000
title: Mulliken charges with hydrogens summed into heavy atoms:
elementType: O O O N C C C C C C C C C C C C C C C C C C
charge: -0.284436 -0.284442 -0.278278 -0.052442 -0.104386 0.072770 0.548317 0.411478 -0.259629 -0.258631 -0.128282 -0.171752 0.237141 -0.079770 0.167810 -0.013599 -0.020031 -0.017226 0.229362 -0.056511 0.163298 0.179239
polarizability: 2.44693649e+02 9.00721844e+00 2.27881232e+02 1.27494926e+01 1.95923194e+01 1.66646854e+02
1716.lowfreq: -5.7232 -0.0004 0.0003 0.0007 3.5344 6.8330 18.2978 26.4242 32.6602
frequency: 17.9437 26.4209 32.6304 36.9177 46.9117 52.7512 69.9692 91.6969 101.9807 104.3517 115.4203 158.8234 171.3990 179.6672 207.2831 216.0344 240.3905 276.9783 277.6785 287.5403 291.6374 335.6942 387.0926 401.7933 434.0872 445.5716 471.1720 474.7249 504.3144 536.9372 557.6207 575.4625 602.3757 617.0680 617.5423 630.5304 656.2786 684.7147 704.8456 723.3977 741.7641 767.1697 821.2602 841.3433 854.1640 867.3734 878.9396 902.0148 930.7715 947.1232 958.0559 977.4158 978.7270 990.1253 992.0849 995.5983 1024.5330 1028.1822 1039.2170 1045.4027 1091.8300 1109.8194 1110.8203 1113.2487 1116.4803 1142.3812 1154.6055 1159.7511 1172.8882 1195.3278 1197.6801 1206.2766 1219.5086 1251.0402 1251.2975 1260.9788 1277.4430 1301.1025 1326.5664 1350.6650 1377.9486 1381.4738 1386.8061 1406.7984 1426.4948 1435.9219 1446.7646 1451.6667 1455.3184 1467.6169 1467.9795 1473.1466 1475.0411 1480.5018 1486.1874 1490.6051 1497.3449 1578.7997 1590.5146 1606.3239 1613.8726 1620.2610 2965.2142 2965.6644 2974.8662 2984.4190 2995.1068 3055.7898 3064.3438 3084.0650 3096.8958 3099.0596 3118.3263 3126.4562 3126.5074 3127.8393 3128.6703 3139.2714 3145.6454 3151.1184 3164.2771 3164.4937 3536.6650
redmass: 4.8293 4.3190 4.3992 4.1981 4.1619 2.3643 2.9534 1.6120 1.7532 3.1905 3.1072 2.0496 3.4714 2.7717 2.3229 4.0110 4.0701 3.9397 2.0218 2.8597 2.9902 4.4764 4.4808 2.8204 3.9886 3.5899 3.5692 3.3583 4.2117 5.4854 3.4833 2.2549 4.9170 1.5286 6.1502 3.3081 4.3284 4.7100 1.6923 4.3547 3.0947 2.0637 2.1169 1.9079 1.2613 1.9441 2.2893 2.7005 1.8957 1.4157 7.0569 1.7738 1.4119 5.1493 5.1112 1.3157 2.5943 2.2286 1.9223 2.0490 1.7111 1.3753 1.8036 1.2591 3.6898 1.8725 1.3852 1.5402 1.0513 1.5167 1.4564 1.8511 1.2722 1.9603 1.9886 1.6829 1.7518 1.5635 1.3567 1.3964 6.0275 6.3122 1.2318 2.1098 1.2238 2.2034 1.3132 1.0460 1.0777 1.1017 1.0568 1.1338 1.1401 1.0558 2.0528 1.9002 2.4666 7.5554 6.0214 6.3716 6.0131 6.0702 1.0614 1.0392 1.0349 1.0797 1.0359 1.1042 1.0963 1.0970 1.0991 1.0996 1.0857 1.0996 1.0873 1.1045 1.0896 1.0926 1.0898 1.0950 1.1006 1.0954 1.0775
irintensity: 0.4575 1.8855 2.4190 3.2796 1.3209 7.2140 4.7342 2.4141 1.9233 5.4779 2.7022 1.4698 3.3809 2.7551 1.4159 3.0778 0.5880 0.9812 2.0374 3.7645 6.7267 2.5453 2.8814 0.1703 5.1769 5.4944 6.8905 8.5795 3.3579 1.7667 26.3805 60.0877 6.7457 52.9982 2.0916 0.2357 18.2129 6.0850 62.6442 3.3641 4.3638 30.1438 31.1719 15.4589 1.1316 17.6397 10.7358 3.1994 6.4896 4.6923 38.8144 6.1481 0.8156 7.7717 35.9327 0.7562 1.9771 12.0084 13.4471 5.5327 10.4444 45.9004 38.7695 0.0781 14.3129 18.8137 8.1777 11.1590 0.0364 6.3634 7.7430 44.0563 43.1139 159.3376 44.4926 56.6574 81.7150 21.6468 6.0219 15.9286 0.2746 9.6975 65.2023 27.7911 4.7969 12.6744 9.8406 11.6954 12.9664 66.9382 27.0704 93.7653 15.5328 30.5694 64.4979 251.5741 95.5028 14.0600 0.7143 14.8814 15.3279 198.3918 4.3567 66.0228 89.4217 31.0692 11.0062 37.9088 9.0684 37.6032 15.1886 16.6749 4.8683 25.8507 0.5865 20.0611 6.5130 22.6440 5.8070 37.6831 22.9177 2.6116 40.6448
temp: 298.150 k
press: 1.00000 atm
elementType: 8 8 8 7 6 6 6 6 6 6 6 6 6 6 6 6 6 6 6 6 6 6 1 1 1 1 1 1 1 1 1 1 1 1 1 1 1 1 1 1 1 1 1
symmnumber: 1
zpe: 919860.8 jmol-1
zpe.correction: 0.350356 hartree
zpe.thermalcorrener: 0.372650 hartree
zpe.thermalcorrenthalpy: 0.373594 hartree
zpe.thermalcorrgfe: 0.295697 hartree
zpe.sumelectzpe: -977.301451 hartree
zpe.sumelectthermal: -977.279157 hartree
zpe.sumelectthermalent: -977.278213 hartree
zpe.sumelectthermalfe: -977.356111 hartree
dipole: -3.9195 2.7591 0.7270
dipole: 4.8481
quadrupole: -149.6275 -121.0222 -121.2624
quadrupole: 2.3782 -1.0726 6.4761
quadrupole: -18.9901 9.6152 9.3750 2.3782 -1.0726 6.4761
hfenergy: -977.6518072 hartree
pointgroup: C01 [X(C18H21N1O3)]
dipole: 0.9079605 1.6601147 -0.2402825 debye
polarizability: 246.7784867|1.6215228|224.1616075|23.3976782|-11.492804|168.2816419 unknown
InChI: InChI=1S/C18H21NO3/c1-13(20)19-12-16(14-7-5-4-6-8-14)15-9-10-17(21-2)18(11-15)22-3/h4-11,16,19H,12H2,1-3H3
charge 0 multiplicity 1
43 atoms
O  2.879812 1.745195 -1.463899
O  4.502749 0.554598 0.553555
O  -2.296127 -4.479099 -0.707517
N  -0.533445 -2.960496 -0.575796
C  -1.147902 -0.709263 0.336869
C  -1.366473 -1.77101 -0.781412
C  0.334465 -0.315398 0.416668
C  -2.070441 0.51268 0.187014
C  0.890596 0.573829 -0.539172
C  1.184904 -0.876501 1.397376
C  -1.956037 1.570382 1.129782
C  -3.05294 0.626687 -0.829121
C  2.263877 0.90196 -0.523077
C  2.557552 -0.538716 1.431249
C  3.114992 0.347091 0.487155
C  -2.795576 2.701142 1.065079
C  -3.894169 1.762909 -0.900713
C  -3.771516 2.803824 0.044828
C  -1.058788 -4.244349 -0.545171
C  -0.043539 -5.359576 -0.304879
C  2.042627 2.289453 -2.537683
C  4.99795 1.947741 0.544258
H  -1.406129 -1.209318 1.293056
H  -2.411291 -2.128098 -0.788626
H  -1.147778 -1.317932 -1.769989
H  0.229064 1.015064 -1.292129
H  0.773886 -1.558553 2.150678
H  0.467779 -2.820636 -0.423674
H  -1.195289 1.501683 1.917037
H  -3.182643 -0.168574 -1.569898
H  3.227867 -0.954024 2.190345
H  -2.691863 3.500503 1.807704
H  -4.648406 1.828478 -1.693292
H  -4.426526 3.680605 -0.008882
H  -0.049922 -6.04495 -1.170138
H  0.985816 -4.993316 -0.146794
H  -0.356018 -5.94562 0.576439
H  1.236446 2.931993 -2.134516
H  1.601927 1.479117 -3.149549
H  2.725345 2.891372 -3.155123
H  4.576833 2.510878 1.399755
H  4.743296 2.451809 -0.401582
H  6.089033 1.858036 0.657587
