program: Gaussian 09
title: 000219686
version: EM64L-G09RevD.01
frameworkgroup: C1[X(C10H10N2O5)]
method: RPBEPBE
basis: SDD
operation: Freq
keyword: #p
keyword: freq=noraman
keyword: PBEPBE/SDD
title: #p freq=noraman PBEPBE/SDD
converged: YES YES NO NO
title: Mulliken charges:
elementType: O O O O O N N C C C C C C C C C C H H H H H H H H H H
charge: -0.277434 -0.244442 -0.189506 -0.256581 -0.218090 -0.441860 0.027053 0.341223 0.224130 -0.284536 0.406621 -0.555437 -0.318780 0.223677 -0.775869 0.263081 -0.745538 0.325376 0.312859 0.312550 0.351307 0.235313 0.260351 0.260189 0.256861 0.250653 0.256828
chargesum: 0.00000
title: Mulliken charges with hydrogens summed into heavy atoms:
elementType: O O O O O N N C C C C C C C C C C
charge: -0.277434 -0.244442 -0.189506 -0.256581 -0.218090 -0.090553 0.027053 0.341223 0.224130 0.040840 0.406621 -0.242578 -0.006230 0.223677 -0.020016 0.263081 0.018805
polarizability: 2.39531217e+02 6.92393106e+00 1.79218269e+02 1.71239948e-01 1.85909598e-02 6.50587994e+01
1716.lowfreq: -45.1487 -7.0192 -1.1603 -0.0007 -0.0007 -0.0006 2.1281 22.4933 46.0544
frequency: -45.0685 22.4814 46.0524 52.0752 74.5765 85.2458 102.7557 111.9518 155.3696 158.4153 216.7616 221.7128 254.9163 297.4518 355.4920 372.6927 382.6217 424.6361 432.9753 497.8640 509.1304 548.8648 558.0825 600.0922 613.8180 644.8154 681.9993 682.3257 724.8708 732.0243 795.6057 839.0472 878.5976 880.1980 921.2786 928.5942 939.4559 993.8418 1000.4990 1013.4867 1040.6729 1044.3067 1058.1176 1142.7370 1158.5174 1167.2292 1181.6030 1225.4047 1244.4989 1301.4353 1339.3053 1358.1869 1385.9374 1391.9140 1428.4749 1451.2557 1451.3318 1452.7624 1466.3008 1487.4926 1506.5880 1571.4472 1625.3484 1629.0501 1667.0654 3000.8373 3009.7634 3097.4278 3097.7579 3108.5324 3146.8144 3185.5642 3193.5185 3212.6805 3289.7746
redmass: 1.0485 8.4513 3.3451 10.6665 1.2507 3.0702 5.3635 5.1727 5.6443 5.2819 6.6305 10.7399 5.3126 6.6260 6.0935 5.8389 5.3554 5.7887 4.2264 4.4639 5.9209 3.1996 3.5839 3.1639 5.2893 6.3371 6.9155 7.9643 5.3990 7.6813 7.6275 5.5535 1.3615 1.1313 1.4588 5.7440 5.7922 1.9750 1.6660 1.2977 1.6387 1.6371 2.4789 2.0556 2.5400 4.2306 2.9878 4.2556 1.5595 2.3243 6.2241 4.7908 1.2332 1.2011 5.9317 1.0596 1.0456 1.0461 1.1022 3.2232 2.9359 4.4699 4.4377 5.5035 9.7543 1.0359 1.0369 1.0973 1.0976 1.1017 1.1011 1.0919 1.0920 1.0950 1.0796
irintensity: 1.0809 2.2767 4.8403 3.4345 0.0099 3.0514 1.6444 4.2548 0.6836 14.1791 1.5633 1.1712 0.9267 0.5906 2.4217 0.0431 0.6233 6.7283 0.7298 3.9034 17.4851 11.6065 9.6955 0.4194 12.6787 3.2893 2.1781 4.9132 2.1689 8.3091 30.8504 18.9096 107.1449 19.4053 30.2959 22.9547 55.7297 172.0800 40.9409 0.9030 9.2117 21.4039 2.2841 86.0850 104.3614 818.9416 113.2267 221.4858 57.7143 31.2254 397.7180 84.6181 57.9025 50.8643 5.8588 26.2208 17.6004 19.8801 15.4926 297.7295 318.3552 277.7309 11.2755 43.6003 201.4148 5.2271 0.4534 4.8845 5.5645 13.8086 9.4020 15.2850 9.3233 4.9860 106.2809
temp: 298.150 k
press: 1.00000 atm
elementType: 8 8 8 8 8 7 7 6 6 6 6 6 6 6 6 6 6 1 1 1 1 1 1 1 1 1 1
symmnumber: 1
zpe: 507649.3 jmol-1
zpe.correction: 0.193353 hartree
zpe.thermalcorrener: 0.209080 hartree
zpe.thermalcorrenthalpy: 0.210024 hartree
zpe.thermalcorrgfe: 0.148056 hartree
zpe.sumelectzpe: -871.390931 hartree
zpe.sumelectthermal: -871.375204 hartree
zpe.sumelectthermalent: -871.374260 hartree
zpe.sumelectthermalfe: -871.436228 hartree
dipole: 1.4747 0.3161 0.0197
dipole: 1.5083
quadrupole: -73.5401 -123.0326 -97.0272
quadrupole: 8.3315 0.2050 -0.0613
quadrupole: 24.3266 -25.1660 0.8395 8.3315 0.2050 -0.0613
hfenergy: -871.5842841 hartree
pointgroup: C01 [X(C10H10N2O5)]
dipole: 0.5878499 -0.0704728 -0.0399139 debye
polarizability: 240.0910682|-0.8666757|173.9780438|-5.6147897|22.1674668|69.7391735 unknown
InChI: InChI=1S/C10H10N2O5/c1-6(13)11-9-4-3-8(17-7(2)14)5-10(9)12(15)16/h3-5,11H,1-2H3
charge 0 multiplicity 1
27 atoms
O  3.098898 -0.005517 -0.140934
O  -3.089935 2.383182 0.532335
O  -0.329413 -3.38269 -0.714321
O  -2.37741 -2.437328 -0.451121
O  3.739754 2.215516 0.327242
N  -2.577872 0.12877 0.068959
N  -1.067432 -2.354983 -0.479896
C  -1.175112 0.149463 0.028067
C  -0.426998 -1.053976 -0.237887
C  -0.421333 1.340657 0.243406
C  1.685806 0.146598 -0.063018
C  0.986144 -1.046196 -0.281428
C  0.981341 1.353111 0.201921
C  -3.461537 1.195194 0.3091
C  -4.932353 0.798686 0.280165
C  4.04194 1.037466 0.059244
C  5.431353 0.470552 -0.108453
H  -0.973416 2.260293 0.444842
H  1.520896 -1.976038 -0.485852
H  1.524184 2.283123 0.373103
H  -2.971298 -0.813445 -0.105807
H  -5.099408 -0.268056 0.057087
H  -5.453217 1.409801 -0.477011
H  -5.38716 1.036201 1.257448
H  5.597482 -0.3495 0.611194
H  6.173937 1.264897 0.051579
H  5.54916 0.046021 -1.120468
