program: Gaussian 09
title: 000218115
version: EM64L-G09RevD.01
frameworkgroup: C1[X(C14H15N3O2)]
method: RPBEPBE
basis: SDD
operation: Freq
keyword: #p
keyword: freq=noraman
keyword: PBEPBE/SDD
title: #p freq=noraman PBEPBE/SDD
converged: NO YES NO NO
title: Mulliken charges:
elementType: O O N N N C C C C C C C C C C C C C C H H H H H H H H H H H H H H H
charge: -0.220143 -0.209737 -0.404583 -0.386804 -0.020778 -0.321492 -0.491092 0.145044 0.015236 0.231581 -0.446946 0.375889 -0.031390 -0.394279 -0.378348 -0.221962 -0.222036 -0.231040 -0.567734 0.284029 0.252838 0.236279 0.322110 0.254144 0.261299 0.321708 0.220130 0.240943 0.244323 0.232816 0.232465 0.235039 0.213317 0.229174
chargesum: 0.00000
title: Mulliken charges with hydrogens summed into heavy atoms:
elementType: O O N N N C C C C C C C C C C C C C C
charge: -0.220143 -0.209737 -0.082473 -0.065096 -0.020778 -0.037463 -0.001974 0.145044 0.015236 0.231581 0.068497 0.375889 0.188740 -0.153336 -0.134026 0.010855 0.010428 0.004000 -0.125243
polarizability: 2.44116646e+02 -3.62674474e+00 1.49658810e+02 -1.93819479e+01 -1.52849269e+00 1.43547850e+02
1716.lowfreq: -22.7816 -3.9366 -2.7878 -0.0010 -0.0009 -0.0008 5.5460 17.9980 20.2897
frequency: -22.4260 17.9956 19.2099 51.2025 55.0478 61.1936 83.3137 130.9023 154.1095 170.0119 209.1905 226.1143 234.7340 308.6725 343.5284 355.2557 380.8411 393.7559 404.5230 415.7766 471.5179 480.3102 506.3261 556.7925 593.7015 611.0848 617.0411 642.2446 679.1542 688.5780 704.8204 708.2887 759.7499 777.5619 811.2921 835.0928 856.6484 857.9140 919.8080 924.4533 940.7805 945.9804 955.6440 979.8335 990.1612 1000.6566 1003.4897 1011.4706 1023.7412 1026.0594 1070.7506 1087.0462 1118.8595 1164.9935 1174.5906 1187.0303 1202.4729 1208.9049 1217.8529 1227.6295 1255.4068 1280.1210 1288.6895 1290.9675 1323.1444 1324.0636 1340.3846 1383.2336 1402.9686 1423.8702 1439.5748 1456.4881 1481.5392 1486.8018 1496.8713 1561.0679 1593.8802 1615.2914 1630.9122 1643.5284 1659.2392 3002.2127 3008.6286 3018.8918 3058.9353 3070.2720 3084.9476 3097.5390 3122.4278 3124.6888 3137.9248 3150.7243 3167.2652 3198.2556 3499.4076 3556.7267
redmass: 3.9586 4.2291 4.8784 4.6386 4.5749 3.0776 5.8039 6.3890 4.3506 4.6958 4.0892 5.0551 3.3872 2.1726 2.9029 4.5382 2.2692 2.3669 2.4171 1.9609 5.5875 8.5960 3.9261 5.9733 2.4504 2.7039 6.1982 2.5195 2.7818 10.5689 2.0393 2.3919 1.9070 4.0293 3.5654 3.1900 1.2454 2.6448 2.3004 1.5974 1.6682 1.8040 1.3956 1.3912 6.1779 1.3242 1.2989 2.7852 3.9068 2.2194 4.3868 1.5352 1.9572 1.3167 1.0544 1.1123 2.2643 1.1509 2.3685 1.4601 1.8420 1.7260 1.6719 1.9313 1.2858 1.4991 1.4445 8.3613 1.9172 1.1549 2.1718 1.1333 1.3581 1.7000 2.2456 9.6426 6.0963 6.1776 7.0984 7.1255 4.6923 1.0623 1.0597 1.0806 1.1040 1.0898 1.0799 1.0846 1.0873 1.0877 1.0913 1.0960 1.1016 1.1151 1.0771 1.0785
irintensity: 1.5238 1.8514 1.2299 0.7622 1.3522 1.4580 2.7405 2.5344 0.4961 9.0693 0.9363 0.9238 3.7075 4.6177 5.7287 7.6127 13.5244 13.9469 3.4375 2.1202 13.9313 11.3554 11.0987 6.0595 28.4515 0.3269 0.0394 65.6020 52.9672 6.8714 51.7015 32.1293 63.1613 2.4531 4.1504 4.4190 0.3536 3.1683 5.9019 2.0682 3.1253 5.6461 85.2512 0.0963 0.7812 0.3757 9.5901 24.7783 10.2824 7.3315 10.5985 7.4934 0.9397 52.8327 0.0235 2.3101 16.3531 1.9525 12.0266 100.7891 29.8951 9.1053 65.8462 97.2490 0.7404 55.8151 7.2022 0.5581 148.5585 13.4133 9.2705 44.0195 79.0916 10.0500 340.4511 1004.0733 1.3791 5.4778 256.0305 281.1684 10.4400 18.8671 10.4063 6.8263 7.4879 2.4140 13.2248 7.1984 6.1991 3.8123 10.2493 32.6196 20.6371 19.3863 17.3480 85.3697
temp: 298.150 k
press: 1.00000 atm
elementType: 8 8 7 7 7 6 6 6 6 6 6 6 6 6 6 6 6 6 6 1 1 1 1 1 1 1 1 1 1 1 1 1 1 1
symmnumber: 1
zpe: 701206.7 jmol-1
zpe.correction: 0.267076 hartree
zpe.thermalcorrener: 0.284056 hartree
zpe.thermalcorrenthalpy: 0.285000 hartree
zpe.thermalcorrgfe: 0.219418 hartree
zpe.sumelectzpe: -855.816899 hartree
zpe.sumelectthermal: -855.799918 hartree
zpe.sumelectthermalent: -855.798974 hartree
zpe.sumelectthermalfe: -855.864556 hartree
dipole: 6.2557 -0.7782 -3.6345
dipole: 7.2766
quadrupole: -107.1726 -110.1247 -122.9106
quadrupole: -5.2696 -0.7806 -9.6221
quadrupole: 6.2300 3.2780 -9.5080 -5.2696 -0.7806 -9.6221
hfenergy: -856.0839741 hartree
pointgroup: C01 [X(C14H15N3O2)]
dipole: -2.4259319 -0.9750231 1.1661695 debye
polarizability: 242.6525403|10.2963912|145.1300149|-20.5040217|3.2176537|149.5407507 unknown
InChI: InChI=1S/C14H15N3O2/c1-2-6-11-12(18)16-14(17-13(11)19)15-9-10-7-4-3-5-8-10/h2-5,7-8,11,15-16H,1,6,9H2
charge 0 multiplicity 1
34 atoms
O  3.199824 -2.88733 -0.20489
O  2.989139 1.578224 -2.091014
N  1.248282 -1.644247 -0.266635
N  -0.789484 -0.457094 -0.279523
N  1.082681 0.605874 -1.174868
C  3.348818 -0.579522 -1.05121
C  4.458797 -0.084486 -0.049516
C  2.630061 -1.798579 -0.483621
C  2.452496 0.611578 -1.483024
C  0.544154 -0.459746 -0.591758
C  -1.652287 0.713229 -0.584414
C  -3.061526 0.465333 -0.071701
C  3.918035 0.305382 1.310477
C  -4.074491 -0.005693 -0.944924
C  -3.380389 0.68687 1.293499
C  -5.381076 -0.252749 -0.46515
C  -4.684853 0.438911 1.776521
C  -5.688265 -0.032595 0.897517
C  3.86429 1.576145 1.781963
H  3.887801 -0.920729 -1.956196
H  4.957308 0.773465 -0.53297
H  5.191885 -0.906431 0.057102
H  0.765847 -2.458914 0.126728
H  -1.6409 0.886296 -1.675756
H  -1.196639 1.607788 -0.122927
H  -1.229123 -1.262853 0.168058
H  3.562558 -0.520697 1.946645
H  -3.840539 -0.170561 -2.003753
H  -2.60815 1.066468 1.973973
H  -6.156384 -0.610408 -1.151499
H  -4.920743 0.620333 2.830895
H  -6.7015 -0.219548 1.269985
H  3.470134 1.803632 2.77917
H  4.208938 2.424852 1.178722
