program: Gaussian 09
title: 000217458
version: EM64L-G09RevD.01
frameworkgroup: C1[X(C15H16ClF3N2S)]
method: RPBEPBE
basis: SDD
operation: Freq
keyword: #p
keyword: freq=noraman
keyword: PBEPBE/SDD
title: #p freq=noraman PBEPBE/SDD
converged: YES YES NO NO
title: Mulliken charges:
elementType: Cl S F F F N N C C C C C C C C C C C C C C C H H H H H H H H H H H H H H H H
charge: -0.071450 0.172749 -0.169376 -0.159780 -0.168232 -0.424520 -0.040197 -0.334130 -0.413273 0.374427 0.281007 -0.658887 -0.018228 -0.336034 -0.319234 0.326603 -0.475339 -0.375059 -0.384716 0.253449 -0.603980 -0.516243 0.220830 0.222063 0.231152 0.230941 0.316681 0.250114 0.259847 0.197706 0.236895 0.295963 0.259563 0.238415 0.269802 0.283550 0.280377 0.266541
chargesum: 0.00000
title: Mulliken charges with hydrogens summed into heavy atoms:
elementType: Cl S F F F N N C C C C C C C C C C C C C C C
charge: -0.071450 0.172749 -0.169376 -0.159780 -0.168232 -0.107839 -0.040197 0.108764 0.048819 0.374427 0.281007 -0.148926 -0.018228 -0.138328 -0.082338 0.326603 -0.179376 -0.115496 -0.146301 0.253449 -0.050628 0.030676
polarizability: 3.32064788e+02 2.03800730e+01 2.14762337e+02 -2.39070259e+00 1.45639363e-01 1.11373649e+02
1716.lowfreq: -12.4093 -11.4159 -4.3996 -0.0025 -0.0022 -0.0021 2.1968 3.0864 17.8471
frequency: -11.7095 -5.9418 17.3924 26.2532 34.8426 52.9943 68.9493 77.0811 101.0212 113.6013 118.4799 146.4588 148.0627 161.9299 195.0261 198.4855 223.9402 257.0542 275.9161 285.8122 328.5352 343.6705 344.8506 384.9573 401.7350 426.8638 461.7334 482.0589 514.8245 530.0258 546.9229 561.2704 617.4370 627.4934 630.4703 673.4802 674.0594 680.6939 708.5122 745.8291 761.7297 766.1770 776.7006 815.4069 826.8362 837.8739 861.2481 875.0196 926.9454 943.8887 955.8458 957.7600 983.6429 1008.8632 1029.4203 1039.4908 1042.1652 1049.9372 1062.8780 1067.7102 1090.8408 1108.7843 1139.3491 1169.8610 1185.5349 1197.9339 1222.5768 1238.3804 1247.2930 1265.6316 1268.2436 1282.0322 1289.4548 1294.5231 1307.8075 1329.2758 1339.6115 1359.9663 1382.7541 1398.1974 1426.1604 1448.2291 1454.5102 1455.4654 1457.0734 1476.9745 1481.3673 1499.3065 1537.3048 1564.2112 1591.9178 1633.0250 2940.8734 2981.8982 2983.2717 3010.1321 3041.7355 3043.4995 3067.3176 3085.6263 3115.7543 3119.7623 3122.8799 3156.8170 3166.3270 3174.3661 3180.6978 3582.5453
redmass: 13.8531 11.7745 7.4384 6.5215 4.4141 5.0473 3.1497 1.9650 3.2976 3.0796 6.1364 2.7572 5.9670 6.2972 6.2499 5.3390 5.0609 3.9134 8.7216 10.5602 7.5819 2.5532 2.1843 4.6815 6.2540 2.8376 6.3683 6.4156 6.5586 7.3941 3.8924 8.3412 8.4003 5.0510 8.6356 7.6685 4.0044 4.6606 4.8901 5.3861 1.1543 1.1564 1.9698 2.1599 1.5200 6.5720 1.2358 6.2511 1.5815 1.3815 1.4374 1.4178 7.0623 5.2621 4.9965 1.2251 4.0637 3.7406 4.6621 2.4849 2.4586 1.1399 2.8776 1.2895 1.6224 1.7054 1.1493 1.2610 1.5735 1.1928 1.1954 1.2027 3.0842 1.0872 1.6286 1.8340 2.0135 1.8803 2.0755 3.6198 2.8533 1.0888 1.1090 1.2049 2.2559 1.1555 2.1457 1.0886 5.4083 3.5922 6.4981 6.7415 1.0572 1.1038 1.0588 1.0556 1.1026 1.0605 1.0567 1.1090 1.1067 1.0881 1.0900 1.1118 1.0955 1.0933 1.0928 1.0765
irintensity: 0.0711 0.2451 2.1262 2.3081 0.2695 1.3991 0.2234 1.4824 0.4588 0.5462 3.9069 1.5349 0.8327 0.1727 0.5923 13.0725 3.9907 0.7527 3.4067 0.0407 0.1007 34.3100 30.9767 1.7997 2.1092 19.9153 0.8966 3.8263 2.3639 9.8736 2.8896 18.7474 2.7767 2.0658 106.1213 1.8090 6.6644 0.6228 3.3064 7.9575 7.5179 8.1257 16.4267 48.4765 17.7463 43.4491 5.8392 64.5389 80.5856 0.5865 12.9902 0.1724 176.5887 9.7064 135.9053 2.5634 119.3847 0.1020 5.0463 1.1098 23.4176 5.1837 44.4745 0.3344 22.8109 64.9569 15.6612 14.6099 20.1468 1.1362 3.0330 2.5461 262.7134 5.6682 48.4285 4.9896 32.0161 84.0910 8.3124 76.4187 6.5163 11.4180 9.3024 0.1785 8.0923 17.1562 10.3951 47.1769 119.9459 291.4473 224.4454 0.8012 43.7120 22.8054 15.2468 26.3604 11.5699 12.5514 15.2053 32.1232 1.0506 16.3206 25.2609 12.8669 4.5849 23.2998 1.2445 32.8047
temp: 298.150 k
press: 1.00000 atm
elementType: 17 16 9 9 9 7 7 6 6 6 6 6 6 6 6 6 6 6 6 6 6 6 1 1 1 1 1 1 1 1 1 1 1 1 1 1 1 1
symmnumber: 1
zpe: 745843.9 jmol-1
zpe.correction: 0.284077 hartree
zpe.thermalcorrener: 0.304768 hartree
zpe.thermalcorrenthalpy: 0.305713 hartree
zpe.thermalcorrgfe: 0.231264 hartree
zpe.sumelectzpe: -1846.738467 hartree
zpe.sumelectthermal: -1846.717776 hartree
zpe.sumelectthermalent: -1846.716832 hartree
zpe.sumelectthermalfe: -1846.791280 hartree
dipole: 6.2752 -0.6866 -0.6936
dipole: 6.3506
quadrupole: -209.8288 -144.8018 -147.2699
quadrupole: 0.4187 -2.8445 -1.7982
quadrupole: -42.5286 22.4983 20.0303 0.4187 -2.8445 -1.7982
hfenergy: -1847.0225442 hartree
pointgroup: C01 [X(C15H16Cl1F3N2S1)]
dipole: 2.4724113 0.066565 0.3541777 debye
polarizability: 330.4485767|-24.6654976|203.4881267|-3.3772001|34.2878936|124.26407 unknown
InChI: InChI=1S/C15H16ClF3N2S/c16-5-9-22-8-1-6-20-13-4-7-21-14-10-11(15(17,18)19)2-3-12(13)14/h2-4,7,10,20H,1,5-6,8-9H2
charge 0 multiplicity 1
38 atoms
Cl 9.838726 -0.436847 -0.856399
S  6.074598 1.082597 1.186517
F  -5.50401 2.497282 -0.513813
F  -6.404585 0.418617 -0.354066
F  -5.771924 1.536517 1.51583
N  1.074395 -0.257662 0.210956
N  -2.402165 -2.512489 -0.886868
C  2.439198 -0.794821 0.146343
C  3.455682 0.2683 0.61275
C  -0.050803 -0.979099 -0.141301
C  -1.377441 -0.383121 -0.053949
C  4.897008 -0.264137 0.550144
C  -2.508828 -1.199318 -0.440445
C  -1.616139 0.956766 0.389489
C  0.032252 -2.314772 -0.598042
C  -4.019297 0.665637 0.071377
C  -3.825139 -0.644527 -0.366035
C  -2.907216 1.479798 0.454959
C  -1.152328 -3.017991 -0.948843
C  -5.3967 1.252425 0.169706
C  7.735251 0.217915 0.878285
C  8.196566 0.476525 -0.550963
H  2.674472 -1.108845 -0.892952
H  2.522728 -1.698686 0.78655
H  3.220194 0.572128 1.652029
H  3.369106 1.169754 -0.025228
H  0.967195 0.701232 0.537213
H  5.177781 -0.519166 -0.486733
H  5.022044 -1.154568 1.191246
H  -0.787542 1.609202 0.689654
H  0.994462 -2.82432 -0.688151
H  -4.65881 -1.285108 -0.665354
H  -3.073777 2.50706 0.792906
H  -1.073072 -4.05376 -1.301184
H  7.611893 -0.858042 1.083628
H  8.439532 0.639054 1.612889
H  8.410293 1.538022 -0.7389
H  7.500705 0.081844 -1.305943
