program: Gaussian 09
title: 000215966
version: EM64L-G09RevD.01
frameworkgroup: C1[X(C14H25NO2)]
method: RPBEPBE
basis: SDD
operation: Freq
keyword: #p
keyword: freq=noraman
keyword: PBEPBE/SDD
title: #p freq=noraman PBEPBE/SDD
converged: YES YES NO NO
title: Mulliken charges:
elementType: O O N C C C C C C C C C C C C C C H H H H H H H H H H H H H H H H H H H H H H H H H
charge: -0.312875 -0.281894 -0.400127 0.080183 0.071599 -0.445005 -0.501455 -0.039747 -0.431446 -0.464436 -0.426346 -0.464027 -0.393450 -0.393333 -0.386821 0.247053 -0.778720 0.172465 0.165193 0.215015 0.200195 0.227281 0.198307 0.263185 0.195587 0.248645 0.220863 0.205919 0.204914 0.193346 0.213875 0.204554 0.201526 0.190698 0.191454 0.203137 0.199997 0.191066 0.301463 0.250951 0.208703 0.252510
chargesum: 0.00000
title: Mulliken charges with hydrogens summed into heavy atoms:
elementType: O O N C C C C C C C C C C C C C C
charge: -0.312875 -0.281894 -0.098663 0.252648 0.236792 -0.029796 -0.075868 0.223438 0.012786 -0.037654 -0.028087 -0.045597 -0.001226 0.001258 0.004242 0.247053 -0.066556
polarizability: 1.99307643e+02 -4.57140313e+00 1.45560816e+02 -2.10850962e+00 -2.34106324e+00 1.37476131e+02
1716.lowfreq: -13.0478 -3.5215 -0.0008 -0.0007 -0.0006 13.9353 28.6985 33.5276 41.9108
frequency: 26.6342 31.4511 41.2987 58.1576 80.1745 89.7406 109.3840 152.9969 169.3606 200.2353 215.0624 224.3089 268.2043 307.3496 318.0199 335.1951 380.1054 398.2726 424.7607 431.4763 439.8026 465.0470 470.5251 506.4856 532.3484 567.5531 587.1242 605.9328 667.3845 775.2925 782.9974 788.6042 806.3486 837.1665 847.5348 878.8689 892.3640 896.5344 909.9630 919.3840 924.0214 938.5259 962.1352 977.5160 1016.5589 1021.6292 1027.7880 1040.5553 1045.1303 1048.2784 1050.0552 1075.9803 1081.2273 1085.0659 1112.7792 1136.5627 1145.2642 1151.2209 1185.3156 1194.3616 1234.4659 1240.5996 1244.9613 1250.5192 1253.1689 1258.6753 1288.8571 1296.4908 1305.1425 1308.2731 1311.3603 1325.7163 1331.2678 1335.4023 1337.9947 1341.5714 1343.9812 1344.8899 1357.8045 1362.3558 1374.5720 1385.0450 1449.8516 1454.5006 1459.5270 1460.5099 1463.3516 1463.7875 1464.7406 1465.2044 1471.4148 1471.9806 1479.3335 1484.6612 1613.1597 2917.5240 2928.8099 2965.0989 2967.6668 2969.4913 2978.0475 2978.5597 2979.2595 2984.9879 2986.5041 2987.8089 2993.0238 3026.3652 3028.6860 3030.4172 3037.0155 3041.8055 3043.4026 3045.1051 3053.9829 3055.6831 3061.1862 3094.5404 3097.6991 3550.9935
redmass: 3.0540 5.0161 4.1200 4.0802 2.2331 1.7847 1.9188 2.9881 4.3147 3.0594 1.8252 2.4703 3.7301 1.9856 2.6628 2.9076 2.6418 2.3346 2.8483 2.3325 2.9271 2.6882 2.1218 2.2928 1.4456 2.6280 3.8182 2.4233 2.7538 1.4872 1.6629 1.9583 2.3950 2.7000 2.2832 1.6967 1.6291 2.2099 2.8140 2.1351 1.9447 1.6237 2.1973 2.6578 2.7638 1.8655 3.8955 1.6472 1.7911 1.1917 2.0041 1.3610 1.2409 1.5258 2.5532 2.1723 2.2935 2.2149 1.4246 1.5083 1.4109 1.3971 1.4915 1.2944 1.3557 1.3278 1.2005 1.4848 1.3239 1.2893 1.5546 1.4885 1.3823 1.4305 1.4657 1.4781 1.4542 1.4994 1.3998 1.3583 1.5285 1.2360 1.0514 1.2269 1.2113 1.0936 1.0883 1.0943 1.0905 1.0853 1.1945 1.1022 1.0973 1.2645 6.4097 1.0822 1.0829 1.0629 1.0636 1.0623 1.0613 1.0627 1.0657 1.0616 1.0621 1.0606 1.0362 1.0854 1.0973 1.0957 1.1018 1.0984 1.1026 1.1013 1.0991 1.1025 1.0985 1.1004 1.0980 1.0777
irintensity: 0.5264 1.3203 6.6141 3.5892 5.6655 1.8332 1.8217 0.0984 4.7722 1.3188 0.3034 0.5880 2.3750 0.6604 3.6389 5.0685 0.3639 1.3685 5.3651 1.8272 0.9246 6.1855 1.3692 0.6514 77.4583 15.7109 9.3370 3.6003 6.5324 0.6548 1.4407 0.8749 2.8325 6.6611 3.6131 1.6773 21.3584 6.5865 8.6842 2.4581 4.0687 4.3216 3.9485 15.7390 1.2867 1.5103 236.6042 12.3950 3.1277 2.5916 31.6914 3.1462 2.4510 0.2579 0.6336 2.4988 4.0135 2.0162 1.0496 0.6376 1.5816 4.2651 40.8872 0.1926 8.1894 5.9181 6.4214 5.8514 0.6580 7.5714 5.9451 40.7393 1.1010 8.9052 0.7363 0.4320 1.5912 4.1928 14.6339 16.1714 1.3667 61.9558 19.2789 140.8865 94.3186 7.0770 8.3038 5.8847 11.1535 19.8520 22.6570 25.7851 2.3065 90.7784 190.5895 25.5715 28.9908 34.7930 40.6124 35.4708 18.4859 8.3379 43.9676 46.0900 23.6826 22.2445 12.5449 29.4932 74.9149 72.5798 9.4760 37.3730 50.6228 33.2847 56.6874 92.4840 39.8425 22.8324 9.7817 15.8444
temp: 298.150 k
press: 1.00000 atm
elementType: 8 8 7 6 6 6 6 6 6 6 6 6 6 6 6 6 6 1 1 1 1 1 1 1 1 1 1 1 1 1 1 1 1 1 1 1 1 1 1 1 1 1
symmnumber: 1
zpe: 977936.5 jmol-1
zpe.correction: 0.372476 hartree
zpe.thermalcorrener: 0.390178 hartree
zpe.thermalcorrenthalpy: 0.391122 hartree
zpe.thermalcorrgfe: 0.325450 hartree
zpe.sumelectzpe: -752.341454 hartree
zpe.sumelectthermal: -752.323752 hartree
zpe.sumelectthermalent: -752.322808 hartree
zpe.sumelectthermalfe: -752.388481 hartree
dipole: 2.9319 -0.3093 -1.7685
dipole: 3.4379
quadrupole: -119.4273 -100.1185 -107.3607
quadrupole: -2.5293 17.6647 -1.5224
quadrupole: -10.4584 8.8503 1.6082 -2.5293 17.6647 -1.5224
hfenergy: -752.7139307 hartree
pointgroup: C01 [X(C14H25N1O2)]
dipole: -1.1304696 -0.1505146 0.7272005 debye
polarizability: 198.8081928|6.2806784|145.947693|-3.8524538|2.0208582|137.5887034 unknown
InChI: InChI=1S/C14H25NO2/c1-11(16)15-12-7-9-14(10-8-12)17-13-5-3-2-4-6-13/h12-15H,2-10H2,1H3
charge 0 multiplicity 1
42 atoms
O  -1.329921 0.085216 0.787614
O  4.951289 0.551351 -1.431205
N  3.383433 0.249662 0.255537
C  -0.22476 -0.622365 0.112579
C  -2.581329 0.192622 0.004885
C  0.500435 0.285578 -0.907344
C  0.735126 -1.076429 1.22617
C  2.723409 -0.89939 -0.406962
C  1.732847 -0.430356 -1.508385
C  1.994191 -1.769438 0.645241
C  -3.422747 -1.099754 0.107389
C  -3.349627 1.400862 0.566439
C  -4.782534 -0.934234 -0.617183
C  -4.715977 1.572793 -0.141777
C  -5.564248 0.280366 -0.061026
C  4.464146 0.902904 -0.311334
C  5.037788 2.065642 0.497038
H  -0.615939 -1.521673 -0.417778
H  -2.338373 0.384092 -1.065673
H  0.815368 1.210794 -0.385939
H  -0.190841 0.590279 -1.716032
H  0.203491 -1.759537 1.913184
H  1.005644 -0.183222 1.826598
H  3.529824 -1.480801 -0.891258
H  1.408134 -1.322552 -2.082376
H  2.267362 0.229401 -2.214466
H  2.69228 -2.044915 1.458809
H  1.691369 -2.713692 0.151461
H  -3.592717 -1.313006 1.181533
H  -2.864209 -1.958922 -0.312768
H  -2.730983 2.310907 0.458298
H  -3.503518 1.238209 1.651848
H  -5.380017 -1.860121 -0.512115
H  -4.608099 -0.78911 -1.704012
H  -4.548166 1.830734 -1.208353
H  -5.265498 2.422267 0.307152
H  -6.513752 0.411108 -0.615373
H  -5.832517 0.085429 0.997825
H  3.011953 0.576153 1.148756
H  4.990435 2.985964 -0.110545
H  4.515288 2.242474 1.453613
H  6.103556 1.867314 0.70434
