program: Gaussian 09
title: 000215548
version: EM64L-G09RevD.01
frameworkgroup: C1[X(C9H20NO4PS)]
method: RPBEPBE
basis: SDD
operation: Freq
keyword: #p
keyword: freq=noraman
keyword: PBEPBE/SDD
title: #p freq=noraman PBEPBE/SDD
converged: YES YES NO NO
title: Mulliken charges:
elementType: S P O O O O N C C C C C C C C C H H H H H H H H H H H H H H H H H H H H
charge: 0.004185 1.106108 -0.472581 -0.506420 -0.644704 -0.277870 -0.378267 -0.019358 -0.711889 -0.667497 -0.814002 0.294869 -0.249783 -0.257107 -0.639672 -0.647781 0.241611 0.378205 0.218419 0.218362 0.223359 0.249783 0.205235 0.206821 0.310254 0.296042 0.224767 0.237501 0.234360 0.239919 0.212776 0.234086 0.253698 0.217674 0.242844 0.236056
chargesum: 0.00000
title: Mulliken charges with hydrogens summed into heavy atoms:
elementType: S P O O O O N C C C C C C C C C
charge: 0.004185 1.106108 -0.472581 -0.506420 -0.644704 -0.277870 -0.000063 0.222253 -0.051750 -0.005658 -0.207706 0.294869 0.212484 0.217173 0.060887 0.048793
polarizability: 2.01597530e+02 3.72596930e+00 1.64313172e+02 -3.34742226e+00 -8.37056474e+00 1.34859721e+02
1716.lowfreq: -10.9438 -8.4522 -0.0011 -0.0011 0.0022 10.7196 11.4685 21.3630 36.0511
frequency: 8.1389 21.0630 35.7681 38.0618 49.6915 68.3630 76.0527 83.8347 86.4370 127.4831 131.9585 152.3443 170.4519 178.8384 200.4454 204.4745 216.9185 238.6111 245.2040 249.3807 287.4883 311.0692 322.0572 334.9417 400.7366 407.4559 410.4133 420.7956 467.3775 474.2019 523.7624 607.8247 636.3166 666.9315 729.0698 797.6052 806.4854 830.0260 831.0672 850.1376 862.8649 876.7223 902.8910 921.3260 947.5014 993.8222 1003.8898 1010.5835 1012.7381 1090.5877 1093.8164 1133.7164 1136.9483 1141.5970 1142.6327 1164.8961 1182.6310 1243.3550 1266.8109 1266.9624 1283.1472 1316.0145 1347.2019 1349.5127 1353.1357 1374.3063 1392.3194 1395.2565 1396.1989 1415.3036 1456.3914 1461.1146 1462.2505 1464.0317 1468.2229 1470.0949 1473.9679 1479.7683 1486.3687 1486.5877 1545.3971 1614.5396 2977.7985 2981.4611 2990.3591 2991.0864 2995.5049 3015.0379 3017.8263 3038.8154 3071.5644 3079.4761 3081.2964 3082.0361 3088.0087 3088.6721 3090.0477 3095.1482 3112.6344 3114.3216 3133.1651 3286.7664
redmass: 3.9107 2.7735 3.1672 2.8030 3.9265 4.0417 4.4409 3.8673 3.0944 4.5830 3.2981 6.8481 3.0935 2.4918 1.8456 1.2727 2.3293 1.5226 2.0703 1.2294 9.0153 3.0960 3.1717 5.4617 2.7709 3.4947 3.4900 3.9870 2.8313 5.1495 6.3567 7.8425 5.3998 6.9130 5.5363 1.1182 1.1197 1.1676 2.2041 3.7480 3.5909 2.1173 2.8499 1.2214 1.4837 2.4611 2.7519 7.6849 3.4138 2.1852 2.2122 1.1719 1.5200 1.5202 2.1141 1.9943 2.1506 1.1856 1.1206 1.1193 2.5178 1.5623 1.2129 1.2142 1.2277 1.2128 1.2256 1.2198 1.2226 1.1024 1.0392 1.0442 1.0531 1.0583 1.0595 1.0751 1.0570 1.0581 1.0574 1.0502 1.6335 5.5083 1.0357 1.0359 1.0367 1.0413 1.0597 1.0851 1.0615 1.0602 1.0998 1.0996 1.1009 1.1010 1.0991 1.0969 1.0992 1.1002 1.1044 1.1025 1.1050 1.0846
irintensity: 0.4834 0.2419 0.5431 0.7013 3.4807 3.5866 2.7447 1.6685 2.3911 1.4112 1.4989 1.4839 8.8200 4.6399 2.0937 2.2840 4.5563 0.2504 7.2367 1.8856 12.6209 2.1473 2.1422 6.7765 17.0064 17.0430 0.4767 42.9128 5.7680 42.4152 13.2338 150.6769 7.7391 79.9393 2.6031 14.4364 7.7951 128.3692 5.5537 124.3930 132.2648 2.5466 3.0559 3.9474 0.2697 3.2274 142.9219 217.1301 17.6293 9.2109 5.6246 3.9675 3.9241 6.6299 16.5746 6.1241 42.9735 6.2577 0.4501 0.4656 53.4392 9.4329 16.9490 10.0096 2.6364 21.5921 23.6741 33.4158 22.6797 26.7565 11.3184 9.3392 13.5423 5.6842 2.5323 3.7658 14.8830 13.2478 14.3923 17.1114 183.2479 198.9843 24.7093 26.1838 11.4206 16.3048 25.6207 3.6324 25.9146 5.1366 15.6487 45.2733 3.0035 12.1226 70.1992 22.4574 14.3371 23.2659 28.2775 26.0538 0.5500 305.3265
temp: 298.150 k
press: 1.00000 atm
elementType: 16 15 8 8 8 8 7 6 6 6 6 6 6 6 6 6 1 1 1 1 1 1 1 1 1 1 1 1 1 1 1 1 1 1 1 1
symmnumber: 1
zpe: 765118.0 jmol-1
zpe.correction: 0.291418 hartree
zpe.thermalcorrener: 0.313251 hartree
zpe.thermalcorrenthalpy: 0.314195 hartree
zpe.thermalcorrgfe: 0.236795 hartree
zpe.sumelectzpe: -1448.589413 hartree
zpe.sumelectthermal: -1448.567580 hartree
zpe.sumelectthermalent: -1448.566636 hartree
zpe.sumelectthermalfe: -1448.644036 hartree
dipole: 3.7384 2.4433 -0.1575
dipole: 4.4688
quadrupole: -108.6108 -104.0617 -123.1972
quadrupole: -12.5133 8.5863 7.4655
quadrupole: 3.3458 7.8949 -11.2406 -12.5133 8.5863 7.4655
hfenergy: -1448.8808309 hartree
pointgroup: C01 [X(C9H20N1O4P1S1)]
dipole: 1.4267966 -0.9932399 0.2623953 debye
polarizability: 201.2469813|-4.8817487|159.8766892|3.3321785|-13.8896965|139.6467526 unknown
InChI: InChI=1S/C5H10NOS.C4H10O3P/c1-4(2)6-5(7)3-8;1-3-6-8(5)7-4-2/h4,6H,3H2,1-2H3;3-4H2,1-2H3
charge 0 multiplicity 1
36 atoms
S  0.728603 0.760514 -1.708581
P  1.367512 -0.177299 0.299272
O  2.694301 0.719331 0.914325
O  2.093497 -1.681327 -0.143392
O  0.174793 -0.253272 1.357373
O  -2.912233 1.624451 -1.872542
N  -2.267111 0.31954 -0.041772
C  -3.568323 -0.376467 0.083687
C  -3.342807 -1.777317 0.686743
C  -4.561686 0.466573 0.919434
C  -0.647689 1.902056 -1.001894
C  -2.044509 1.263638 -1.013123
C  3.832557 1.151352 0.042195
C  1.267009 -2.933587 -0.06403
C  4.887883 0.054947 -0.106254
C  0.384395 -3.118045 -1.29938
H  -3.975567 -0.467465 -0.941087
H  -1.508078 0.092334 0.626669
H  -2.896669 -1.70749 1.697028
H  -4.305057 -2.311416 0.77724
H  -2.669462 -2.381341 0.051522
H  -4.699016 1.459211 0.457553
H  -4.188846 0.603029 1.951435
H  -5.54712 -0.032605 0.96783
H  -0.64879 2.767511 -1.680901
H  -0.337648 2.21521 0.009413
H  3.429526 1.480836 -0.935887
H  4.224896 2.029041 0.581659
H  2.036368 -3.719241 0.011088
H  0.675716 -2.909616 0.869934
H  5.74162 0.447819 -0.690386
H  5.261598 -0.262441 0.881883
H  4.47961 -0.828115 -0.625654
H  -0.115184 -4.103841 -1.24736
H  -0.394982 -2.33917 -1.36718
H  0.988091 -3.086234 -2.222158
