program: Gaussian 09
title: 000214872
version: EM64L-G09RevD.01
frameworkgroup: C1[X(C13H15N3OS)]
method: RPBEPBE
basis: SDD
operation: Freq
keyword: #p
keyword: freq=noraman
keyword: PBEPBE/SDD
title: #p freq=noraman PBEPBE/SDD
converged: YES YES NO NO
title: Mulliken charges:
elementType: S O N N N C C C C C C C C C C C C C H H H H H H H H H H H H H H H
charge: 0.201074 -0.199643 -0.033587 -0.120530 -0.025389 -0.540153 -0.323726 0.060117 -0.104515 -0.680604 -0.602532 0.431679 -0.324051 -0.378216 -0.359558 -0.222322 -0.217485 -0.226843 0.295199 0.249026 0.224489 0.213718 0.219612 0.225544 0.286748 0.247875 0.241532 0.257467 0.231661 0.272473 0.233415 0.232902 0.234625
chargesum: 0.00000
title: Mulliken charges with hydrogens summed into heavy atoms:
elementType: S O N N N C C C C C C C C C C C C C
charge: 0.201074 -0.199643 -0.033587 -0.120530 -0.025389 -0.244954 0.149789 0.060117 -0.104515 -0.021730 0.173623 0.431679 -0.066584 -0.146556 -0.087085 0.011093 0.015416 0.007782
polarizability: 3.40634144e+02 1.97812603e+01 1.89856602e+02 8.29644429e+00 -9.73846470e+00 1.06642690e+02
1716.lowfreq: -7.6743 -0.0018 0.0006 0.0009 2.1668 6.3194 23.3177 35.3088 38.4980
frequency: 23.1147 35.2428 38.4812 51.6401 95.7912 100.6486 105.9415 138.3454 145.9073 170.9892 183.6915 211.6915 231.8185 266.3952 284.0545 307.2951 331.5771 368.9639 402.3494 403.1583 436.1318 485.0193 514.2211 520.6095 565.6461 575.2214 614.6899 628.2416 646.2952 670.6555 696.6754 722.7114 772.5712 806.6714 845.4214 855.7705 857.6699 913.2543 924.4717 929.7269 971.2464 987.9579 988.4811 1006.3301 1022.7018 1042.8964 1057.1797 1078.2796 1084.7190 1103.4585 1125.9540 1128.7380 1171.7644 1174.9734 1184.7716 1190.8963 1228.2340 1242.4296 1274.5554 1316.2691 1325.3195 1339.4548 1361.3959 1391.5563 1394.8226 1407.7021 1437.2238 1459.3400 1463.5938 1475.8165 1482.6645 1483.2941 1483.5983 1512.8932 1552.1375 1591.0686 1611.5660 1628.5652 2976.8907 2992.4247 3006.6231 3035.9595 3045.4497 3051.1273 3076.6065 3080.1528 3098.4548 3123.2864 3133.6660 3147.1391 3150.0015 3161.1753 3171.6434
redmass: 4.3466 6.6671 4.3346 4.9581 1.5051 1.6037 3.4860 3.8995 6.8070 3.2628 4.4545 6.0270 1.3163 3.1001 3.6660 4.0143 4.7026 3.2018 5.6752 2.8251 9.2907 7.6280 3.5265 5.8123 5.0126 10.8849 6.4595 5.5964 6.9624 3.8739 1.7664 5.7226 1.7342 1.3411 4.3044 1.2573 3.9311 5.0164 2.4706 1.3982 1.5247 1.4177 5.7177 1.3393 2.2096 1.6858 2.7590 1.8680 1.5774 2.5088 1.3032 2.9046 2.0398 1.0867 1.1317 2.0204 1.3409 1.9578 1.2045 2.0697 2.2992 1.4069 1.9405 5.0512 1.2147 1.2741 2.3297 1.0728 1.1630 1.0476 1.1461 1.0507 2.1192 3.8548 5.5162 5.7458 6.0337 12.0613 1.0360 1.0601 1.0333 1.0893 1.0894 1.0959 1.1009 1.0995 1.1026 1.0876 1.0873 1.0921 1.1015 1.0962 1.1006
irintensity: 0.9512 2.2588 0.1605 1.4722 0.7845 0.5801 4.3463 2.5641 0.7482 16.2472 18.6939 14.3756 1.7617 9.8373 2.1617 2.6372 4.8392 1.4075 9.4871 0.4595 4.9516 25.1446 7.7970 21.2765 6.1627 10.5269 0.3142 17.7888 2.3856 1.5634 52.2331 3.1810 48.1192 20.1766 6.4969 0.2391 6.1167 18.1349 40.0018 0.8399 17.5434 0.1421 0.2481 0.7381 12.7946 12.3167 121.9770 7.2708 19.8522 0.7944 1.1848 25.1090 167.0169 8.7157 11.2969 86.0773 3.5062 33.4260 1.3401 7.5239 21.4589 4.8167 3.9586 8.1981 20.0314 145.7317 10.4253 7.0480 82.4600 15.5460 25.0570 10.1058 13.5659 1199.7644 35.1173 3.1524 5.0368 123.3476 25.5455 11.7222 41.0809 1.3747 26.8910 1.6999 50.0472 43.1437 17.5149 6.5990 0.3558 19.6828 0.0877 21.0291 23.7153
temp: 298.150 k
press: 1.00000 atm
elementType: 16 8 7 7 7 6 6 6 6 6 6 6 6 6 6 6 6 6 1 1 1 1 1 1 1 1 1 1 1 1 1 1 1
symmnumber: 1
zpe: 675371.0 jmol-1
zpe.correction: 0.257235 hartree
zpe.thermalcorrener: 0.275106 hartree
zpe.thermalcorrenthalpy: 0.276050 hartree
zpe.thermalcorrgfe: 0.209259 hartree
zpe.sumelectzpe: -1140.572980 hartree
zpe.sumelectthermal: -1140.555109 hartree
zpe.sumelectthermalent: -1140.554165 hartree
zpe.sumelectthermalfe: -1140.620956 hartree
dipole: 5.7124 2.3203 -0.2998
dipole: 6.1730
quadrupole: -124.2153 -104.5642 -112.7341
quadrupole: -9.8991 -1.7411 -3.8934
quadrupole: -10.3775 9.2737 1.1038 -9.8991 -1.7411 -3.8934
hfenergy: -1140.830215 hartree
pointgroup: C01 [X(C13H15N3O1S1)]
dipole: 2.2959033 -0.7745863 0.1645562 debye
polarizability: 342.2441695|-12.0363748|185.9227415|-8.5611549|-16.6037712|108.9665252 unknown
InChI: InChI=1S/C13H15N3OS/c1-3-11-12(17)15-13(18-11)16(2)14-9-10-7-5-4-6-8-10/h4-9,11H,3H2,1-2H3
charge 0 multiplicity 1
33 atoms
S  -1.32702 -0.877644 -0.433351
O  -5.037273 0.512301 0.082932
N  -2.826066 1.343983 0.178555
N  -0.515633 1.801404 0.051427
N  0.850299 1.48984 -0.162306
C  -3.221407 -1.063341 -0.378313
C  -3.679906 -2.145341 0.61943
C  -3.795346 0.3457 -0.016867
C  -1.575348 0.927878 0.007148
C  -3.272921 -3.574152 0.209326
C  -0.751288 3.264067 0.086109
C  2.744835 0.025072 0.202753
C  1.344127 0.409509 0.416454
C  3.25577 -1.108364 0.894161
C  3.603959 0.75625 -0.667418
C  4.60043 -1.501146 0.726898
C  4.945117 0.362182 -0.829118
C  5.448721 -0.766652 -0.13374
H  -3.546871 -1.320919 -1.402194
H  -4.783198 -2.065162 0.675919
H  -3.28729 -1.905185 1.625464
H  -3.678495 -3.832701 -0.786793
H  -2.173123 -3.684695 0.168445
H  -3.659414 -4.313332 0.933755
H  -1.835369 3.438132 0.100451
H  -0.289177 3.714756 -0.808286
H  -0.285919 3.693569 0.989098
H  0.750852 -0.22502 1.096591
H  2.596777 -1.678147 1.561034
H  3.198288 1.620279 -1.20277
H  4.985663 -2.375034 1.263003
H  5.602891 0.927437 -1.498397
H  6.492736 -1.071321 -0.266097
