program: Gaussian 09
title: 000212997
version: EM64L-G09RevD.01
frameworkgroup: C1[X(C11H15NO4)]
method: RPBEPBE
basis: SDD
operation: Freq
keyword: #p
keyword: freq=noraman
keyword: PBEPBE/SDD
title: #p freq=noraman PBEPBE/SDD
converged: YES YES NO NO
title: Mulliken charges:
elementType: O O O O N C C C C C C C C C C C H H H H H H H H H H H H H H H
charge: -0.450853 -0.438173 -0.208032 -0.210741 0.024460 0.145598 -0.384773 0.441494 -0.438102 -0.437631 -0.723024 -0.362849 -0.330280 -0.393778 -0.420352 0.386588 0.179206 0.226511 0.209003 0.262860 0.221999 0.206502 0.249376 0.231157 0.203776 0.276066 0.245683 0.285554 0.285582 0.344852 0.372321
chargesum: 0.00000
title: Mulliken charges with hydrogens summed into heavy atoms:
elementType: O O O O N C C C C C C C C C C C
charge: -0.106001 -0.065852 -0.208032 -0.210741 0.024460 0.145598 0.020943 0.441494 0.033761 -0.009130 -0.038715 -0.086783 -0.084596 -0.108224 -0.134769 0.386588
polarizability: 2.07468097e+02 -5.40319701e+00 1.35436133e+02 3.80105833e+00 1.47552045e+01 9.61205688e+01
1716.lowfreq: -7.1711 -0.0008 -0.0006 0.0004 5.7373 15.6633 33.5627 52.4850 66.9986
frequency: 33.3570 52.3608 66.9221 75.8909 100.3443 115.6747 151.6209 171.8809 196.8070 222.3819 256.7117 285.3084 296.7769 317.7772 325.7759 331.1247 369.9969 397.0426 415.2909 463.7356 501.2957 517.7825 547.3050 570.9836 628.6682 637.2636 675.1084 710.3031 746.1705 769.5104 789.8707 820.1202 848.6180 855.3668 889.1994 956.0581 966.5635 985.0402 993.7770 997.5312 1002.5885 1009.6079 1046.5722 1079.7888 1091.7325 1101.0253 1123.8901 1144.7143 1188.0334 1196.0575 1203.5123 1229.0154 1238.4823 1301.8323 1310.3229 1324.1295 1337.2125 1356.4833 1360.4760 1378.1729 1385.4128 1390.6555 1400.9106 1415.1342 1462.2637 1465.2302 1482.2879 1485.9270 1491.8969 1494.2908 1592.1401 1606.3401 2945.0592 2983.4582 2992.0348 3003.7066 3009.7630 3068.6631 3072.7081 3093.0595 3098.0696 3162.1176 3173.5414 3183.2823 3192.4115 3535.7448 3574.9106
redmass: 5.4707 6.4175 4.2511 4.6318 5.3573 2.5570 4.5365 4.6613 3.2892 4.6260 1.8628 1.8909 1.3835 3.9938 3.0531 2.0936 3.1195 4.2672 3.0534 4.8852 4.6315 3.5158 1.5745 1.7265 7.0546 3.8726 4.4614 4.5329 4.0886 1.8044 3.7805 2.1822 1.4150 1.4975 1.9780 3.5078 2.3801 1.4720 1.4066 1.8007 2.4217 2.4307 2.7874 2.0534 2.6731 2.4296 1.3600 1.8393 1.8384 1.6573 1.5882 3.1696 1.9649 1.2579 1.3004 1.2621 1.4584 1.2756 4.2213 1.2059 1.4701 3.7943 1.2388 3.3813 1.1050 1.0730 1.4815 1.0497 1.2724 1.1212 7.3821 6.1244 1.0641 1.0380 1.0650 1.0644 1.0950 1.0983 1.0980 1.0995 1.1001 1.0879 1.0888 1.0957 1.0960 1.0657 1.0664
irintensity: 0.3332 1.6333 1.0959 1.2851 5.3002 2.6775 2.1084 2.2349 1.3618 0.3881 8.0744 53.4576 7.4419 5.6757 3.3355 88.8004 3.5359 1.4220 0.7806 7.3069 5.8766 7.3664 81.4647 111.3506 0.8941 1.6632 28.5287 16.5032 2.3682 11.7186 31.1257 9.6210 12.2381 38.4449 7.9833 99.1893 100.9362 15.5506 0.5849 18.4171 6.1227 5.3251 28.5086 4.6640 12.4528 15.1937 13.8052 23.4279 16.6899 154.3179 10.4386 240.7148 14.3792 3.4742 0.1259 7.7477 3.7576 50.2360 52.6541 11.6311 25.4402 22.0645 7.2715 40.2716 2.3025 2.1979 26.7095 12.0517 4.5623 13.0576 2.7647 65.9136 46.5665 20.3669 75.2778 33.6399 15.4424 42.6412 29.8521 38.5555 13.8460 7.7899 1.0405 3.6415 2.8239 22.5281 12.2594
temp: 298.150 k
press: 1.00000 atm
elementType: 8 8 8 8 7 6 6 6 6 6 6 6 6 6 6 6 1 1 1 1 1 1 1 1 1 1 1 1 1 1 1
symmnumber: 1
zpe: 650995.7 jmol-1
zpe.correction: 0.247951 hartree
zpe.thermalcorrener: 0.264035 hartree
zpe.thermalcorrenthalpy: 0.264979 hartree
zpe.thermalcorrgfe: 0.204016 hartree
zpe.sumelectzpe: -782.488563 hartree
zpe.sumelectthermal: -782.472479 hartree
zpe.sumelectthermalent: -782.471535 hartree
zpe.sumelectthermalfe: -782.532498 hartree
dipole: -6.7430 3.1163 -1.2135
dipole: 7.5268
quadrupole: -116.3400 -97.3170 -94.7520
quadrupole: -7.9228 2.6077 1.8122
quadrupole: -13.5370 5.4860 8.0510 -7.9228 2.6077 1.8122
hfenergy: -782.7365138 hartree
pointgroup: C01 [X(C11H15N1O4)]
dipole: -2.6830543 -1.253102 0.0024878 debye
polarizability: 207.7149062|4.4314532|119.8408685|-1.2598705|24.2149646|111.4690246 unknown
InChI: InChI=1S/C11H15NO4/c1-2-11(7-13,8-14)9-3-5-10(6-4-9)12(15)16/h3-6,13-14H,2,7-8H2,1H3
charge 0 multiplicity 1
31 atoms
O  -3.897213 0.818956 -1.251423
O  -2.416567 2.418418 0.740659
O  4.508376 0.80046 0.686044
O  4.422071 -0.754351 -0.980475
N  3.858751 0.021215 -0.113474
C  -1.991452 -0.022156 0.191507
C  -2.58433 -1.394472 0.680886
C  -0.451039 -0.012306 0.139652
C  -2.498757 0.35502 -1.243036
C  -2.568074 1.035368 1.188398
C  -2.198742 -2.697298 -0.05144
C  0.328237 0.840408 0.970347
C  0.242048 -0.821638 -0.808639
C  1.734475 0.855117 0.898861
C  1.645503 -0.82031 -0.899517
C  2.379785 0.015086 -0.031916
H  -3.691554 -1.293953 0.650558
H  -2.329257 -1.505081 1.754268
H  -2.366546 -0.486354 -1.950177
H  -1.927142 1.218245 -1.617749
H  -2.050545 0.972362 2.160096
H  -3.637269 0.805201 1.365679
H  -1.131837 -2.944399 0.076318
H  -2.784097 -3.538102 0.363677
H  -2.41666 -2.653522 -1.135207
H  -0.160438 1.530484 1.660874
H  -0.317178 -1.461666 -1.496369
H  2.333699 1.509667 1.537201
H  2.175806 -1.44508 -1.622913
H  -4.506524 0.061626 -1.066446
H  -3.088929 2.565452 0.024855
