program: Gaussian 09
title: 000214145
version: EM64L-G09RevD.01
frameworkgroup: C1[X(C16H26FNO)]
method: RPBEPBE
basis: SDD
operation: Freq
keyword: #p
keyword: freq=noraman
keyword: PBEPBE/SDD
title: #p freq=noraman PBEPBE/SDD
converged: YES YES NO NO
title: Mulliken charges:
elementType: F O N C C C C C C C C C C C C C C C C H H H H H H H H H H H H H H H H H H H H H H H H H H
charge: -0.215506 -0.279965 -0.095868 -0.169482 -0.074133 -0.438563 -0.370278 0.398000 -0.764879 0.205447 -0.727207 -0.603989 -0.621289 -0.619171 -0.330149 0.338083 -0.407590 -0.245442 -0.687400 0.210634 0.234731 0.226326 0.201357 0.185620 0.222151 0.229108 0.212711 0.209877 0.206705 0.217252 0.239952 0.261295 0.225698 0.189442 0.221413 0.219506 0.187852 0.223585 0.245542 0.250978 0.208272 0.207951 0.210110 0.230266 0.231046
chargesum: 0.00000
title: Mulliken charges with hydrogens summed into heavy atoms:
elementType: F O N C C C C C C C C C C C C C C C C
charge: -0.215506 -0.279965 -0.095868 0.041152 0.160598 -0.010880 0.037494 0.398000 -0.113183 0.205447 -0.063298 -0.342694 0.015263 0.011772 -0.084607 0.338083 -0.156612 0.170781 -0.015979
polarizability: 2.12574198e+02 -5.36473632e+00 1.95325439e+02 -4.80635742e+00 1.20357880e+00 1.46993757e+02
1716.lowfreq: -6.2022 0.0002 0.0006 0.0008 8.7942 10.3702 25.0657 30.6132 47.4194
frequency: 24.2930 30.5816 47.2290 54.0575 64.6613 78.2623 84.0423 96.3334 121.1747 145.0656 155.1837 193.6065 211.0282 218.2586 226.4897 239.6713 245.3022 250.5093 257.2903 273.5526 291.9199 315.6525 331.3659 355.6830 373.4622 380.0126 394.6648 423.2060 444.4230 481.6358 494.9639 539.5159 545.5715 598.0616 642.9426 714.1969 730.2762 755.1165 763.8829 788.4442 798.9574 832.0180 832.7743 868.1983 877.1582 892.3184 909.6169 927.3462 965.4854 985.1118 991.4685 1020.7350 1026.3058 1031.9553 1035.9941 1056.1271 1088.8750 1094.3265 1107.1836 1117.4871 1132.5383 1135.3141 1143.4590 1149.9210 1155.6948 1180.1038 1194.4345 1224.1966 1239.9729 1247.0970 1263.3019 1263.4882 1281.3883 1293.6426 1297.1625 1315.8143 1332.3641 1353.2607 1359.3961 1367.3467 1383.8272 1385.4541 1389.4076 1399.1204 1415.1487 1418.1312 1439.2318 1455.2412 1459.3243 1462.2308 1464.0868 1472.2038 1473.2628 1473.7949 1475.0000 1477.6949 1483.0017 1484.3210 1486.0241 1493.7105 1495.3685 1600.5202 1608.6566 2843.9097 2853.4406 2871.4044 2950.8474 2965.3780 2972.6519 2979.8164 2986.7013 2996.0001 3002.6635 3008.5047 3013.8775 3020.8966 3029.3670 3041.4873 3062.5495 3068.6749 3072.7044 3075.8899 3078.3372 3083.0453 3093.5743 3103.9459 3153.7360 3160.6837 3181.0386
redmass: 2.9980 3.6329 2.8639 4.1331 3.1482 3.0623 2.8899 2.3818 1.8808 2.8905 5.9867 2.9207 1.6022 2.4727 1.1609 1.1072 2.5210 1.1782 2.0530 1.6080 2.6537 3.0783 3.8092 3.7557 4.2720 2.0880 2.5191 2.9727 2.5275 3.3471 4.3269 2.7431 3.9862 3.7796 6.1986 5.1271 3.4606 3.7373 1.3233 1.7654 2.1763 3.1871 1.1358 2.0361 1.5151 2.9627 1.3408 2.9509 1.6837 1.9228 1.6370 2.3220 1.5246 1.5217 2.8015 2.9850 1.3812 1.8197 1.9178 2.0334 1.5451 1.4369 1.8017 1.5630 1.9409 2.6804 2.5851 1.5906 3.2209 1.8500 1.1502 1.7733 1.1602 1.3590 1.4225 1.5490 1.3490 1.3248 1.4382 1.3506 2.7504 1.3641 1.2320 1.3294 3.6495 1.1561 1.1556 1.0751 1.0482 1.0431 1.0651 1.1582 1.2068 1.1092 1.0700 1.0727 1.2366 1.0719 1.0544 1.0872 1.2461 7.6548 7.0780 1.0571 1.0605 1.0676 1.0553 1.0645 1.0363 1.0411 1.0745 1.0361 1.0846 1.1074 1.0720 1.0718 1.0960 1.0887 1.0989 1.0984 1.1009 1.0988 1.1006 1.1003 1.0989 1.1014 1.0920 1.0876 1.0968
irintensity: 0.2080 0.1457 0.0486 0.2602 0.1517 0.6653 1.2931 0.1828 1.8090 0.3282 2.3382 0.1553 0.6328 0.0953 0.2412 0.4663 0.0396 0.7984 0.8605 0.1416 6.3748 2.7977 1.8388 3.4059 0.6675 2.2490 1.1193 1.0010 0.4564 4.8252 3.2893 2.6802 4.4088 0.5175 4.8454 41.2443 1.2288 2.6456 12.0016 53.6871 21.5947 8.9827 0.6196 4.5441 24.9049 49.6177 0.2364 10.4371 0.4358 5.2985 6.5116 19.2471 11.2449 16.7447 56.0369 20.9940 1.0606 10.3494 10.6341 17.3871 3.8038 3.6949 5.1486 32.3866 18.1404 155.4031 25.2734 47.3553 8.8754 2.1129 0.1880 4.8844 2.5579 3.7159 4.2594 0.3173 6.2064 0.6893 9.0221 4.4423 1.8141 10.8154 32.2710 39.2215 21.0268 2.0336 3.8988 5.1296 12.3993 15.0343 3.0383 38.3401 52.5933 36.1752 10.7982 36.7186 37.7803 21.3056 2.1693 5.4886 36.0968 5.3874 12.5368 68.0422 116.5148 177.4324 49.6806 33.4468 25.1527 33.2007 14.1388 20.9413 23.7639 32.5614 40.1466 45.0510 22.4592 18.3519 36.0619 73.0682 28.8714 26.4428 60.9910 55.9458 32.1737 33.2951 4.8018 8.0632 5.6141
temp: 298.150 k
press: 1.00000 atm
elementType: 9 8 7 6 6 6 6 6 6 6 6 6 6 6 6 6 6 6 6 1 1 1 1 1 1 1 1 1 1 1 1 1 1 1 1 1 1 1 1 1 1 1 1 1 1
symmnumber: 1
zpe: 1017644.2 jmol-1
zpe.correction: 0.387600 hartree
zpe.thermalcorrener: 0.409543 hartree
zpe.thermalcorrenthalpy: 0.410488 hartree
zpe.thermalcorrgfe: 0.336010 hartree
zpe.sumelectzpe: -853.586089 hartree
zpe.sumelectthermal: -853.564146 hartree
zpe.sumelectthermalent: -853.563202 hartree
zpe.sumelectthermalfe: -853.637679 hartree
dipole: -0.0476 3.9550 -0.8172
dipole: 4.0389
quadrupole: -116.2359 -112.6237 -117.5110
quadrupole: 12.0435 2.8532 -0.1840
quadrupole: -0.7790 2.8332 -2.0542 12.0435 2.8532 -0.1840
hfenergy: -853.973689 hartree
pointgroup: C01 [X(C16H26F1N1O1)]
dipole: 0.3003513 -1.1652801 -1.0377196 debye
polarizability: 213.553328|2.5510285|183.9167118|-7.2283486|19.0214987|157.4233546 unknown
InChI: InChI=1S/C16H26FNO/c1-6-12(3)15(11-18(4)5)14-10-13(17)8-9-16(14)19-7-2/h8-10,12,15H,6-7,11H2,1-5H3
charge 0 multiplicity 1
45 atoms
F  -3.959612 1.756991 1.384734
O  -0.385611 -1.969436 -0.807659
N  2.292617 1.581653 -1.2088
C  0.71397 0.392996 0.386138
C  1.468535 -0.600158 1.343482
C  1.355183 0.439479 -1.041405
C  2.972462 -0.231972 1.513803
C  -0.788418 0.114603 0.324648
C  0.763607 -0.718831 2.717348
C  -1.328718 -1.067817 -0.272372
C  3.259929 1.094995 2.251517
C  -1.700234 1.044697 0.872776
C  1.588294 2.867749 -1.392351
C  3.274139 1.347174 -2.287827
C  -2.725826 -1.296809 -0.312915
C  -3.08338 0.799008 0.823732
C  -3.622079 -0.35405 0.241776
C  -0.887851 -3.204694 -1.438957
C  0.332489 -3.985479 -1.920103
H  0.828635 1.403077 0.826565
H  1.429429 -1.596195 0.857469
H  1.915966 -0.496386 -1.214663
H  0.550006 0.470979 -1.817046
H  3.458037 -1.065417 2.063499
H  3.454084 -0.183455 0.518727
H  -0.234529 -1.181529 2.622482
H  0.625717 0.270862 3.192526
H  1.3646 -1.341395 3.406907
H  4.349718 1.238607 2.373472
H  2.805947 1.114555 3.259154
H  2.879007 1.954487 1.672019
H  -1.333081 1.962108 1.344087
H  0.895155 3.04994 -0.552605
H  0.989636 2.905481 -2.338918
H  2.320383 3.69504 -1.413611
H  3.985919 2.191548 -2.332126
H  2.807615 1.240016 -3.300926
H  3.848085 0.426922 -2.077019
H  -3.133814 -2.201901 -0.77012
H  -4.703899 -0.512324 0.220894
H  -1.47031 -3.789053 -0.696643
H  -1.556477 -2.942277 -2.284995
H  0.012875 -4.925152 -2.406225
H  0.911692 -3.394127 -2.649764
H  0.99341 -4.237806 -1.073309
