program: Gaussian 09
title: 000212249
version: EM64L-G09RevD.01
frameworkgroup: C1[X(C13H20NO2)]
method: RPBEPBE
basis: SDD
operation: Freq
keyword: #p
keyword: freq=noraman
keyword: PBEPBE/SDD
title: #p freq=noraman PBEPBE/SDD
converged: YES YES NO NO
title: Mulliken charges:
elementType: O O N C C C C C C C C C C C C C H H H H H H H H H H H H H H H H H H H H
charge: -0.481784 -0.225513 -0.101852 -0.362265 -0.311786 -0.587236 -0.577417 -0.573624 -0.339804 0.128969 0.288182 -0.329022 -0.325826 -0.241205 -0.220291 -0.207187 0.308560 0.297512 0.270521 0.271161 0.248960 0.266399 0.331465 0.281748 0.259528 0.269975 0.269287 0.244940 0.241727 0.247153 0.393515 0.228941 0.282941 0.246582 0.253029 0.253720
chargesum: 1.00000
title: Mulliken charges with hydrogens summed into heavy atoms:
elementType: O O N C C C C C C C C C C C C C
charge: -0.088269 -0.225513 -0.101852 0.243806 0.229895 0.259587 0.233833 -0.059398 0.149076 0.128969 0.288182 -0.100082 -0.042885 0.005377 0.032738 0.046534
polarizability: 2.10003075e+02 7.52343505e+00 1.41184647e+02 -7.99405928e+00 -1.36013551e+01 1.04079157e+02
1716.lowfreq: -25.2053 -16.0659 -10.0378 -0.0001 0.0003 0.0005 4.4997 21.7647 49.4619
frequency: -23.6808 19.1507 49.4451 62.8325 70.5477 138.3605 155.1695 179.7599 190.2362 217.6265 250.6161 277.5600 291.0491 303.6552 328.2401 347.2849 380.7144 389.6941 396.6916 412.3019 426.0189 464.3522 487.4601 553.5105 581.4283 611.7278 636.1095 691.1057 702.0034 761.6283 773.6183 823.5517 845.3252 853.6504 859.3460 927.0585 947.9131 952.0181 967.3135 979.6042 988.8295 996.1544 1018.8270 1025.5206 1030.9121 1051.8613 1068.0276 1093.2261 1102.0369 1105.4328 1126.6367 1181.8516 1189.2479 1193.2509 1198.8392 1211.5600 1230.2178 1240.5432 1255.8690 1276.2661 1302.6117 1323.6551 1334.6014 1367.1645 1377.1661 1393.3287 1413.6539 1427.4307 1437.2181 1439.2335 1447.2970 1452.4542 1464.0870 1469.4140 1475.7268 1481.3599 1490.4908 1494.9549 1502.3744 1564.7415 1594.8119 1609.6587 2980.8785 3002.8690 3010.9322 3023.0076 3025.6060 3027.6610 3037.3105 3072.1908 3103.7648 3106.4079 3136.3811 3136.9295 3139.7935 3146.9400 3151.4983 3157.2908 3157.3112 3167.2231 3179.0780 3594.1458
redmass: 3.5753 5.0778 4.0312 4.4239 3.7889 3.2886 4.2272 2.6468 2.2887 3.1404 1.2879 1.1328 3.0193 3.1091 1.5424 1.5649 3.0554 2.5786 2.7694 3.2393 2.6943 2.9365 3.6356 2.4847 2.7860 6.4186 5.9635 1.7796 3.6822 2.6184 1.9376 2.3699 2.1908 1.2764 2.2179 2.7406 1.9848 1.9596 4.7354 2.2381 6.1943 1.3881 1.3678 1.9724 1.6208 2.2042 2.6367 1.6044 2.3747 1.3201 1.4597 1.0646 1.1474 1.1613 1.2889 1.3814 1.6771 1.8627 1.4090 1.5686 1.3605 1.3410 1.2497 1.2899 1.2702 8.6049 1.2934 1.2152 1.1326 2.2485 1.1246 1.1111 1.0519 1.0672 1.0783 2.0157 1.0702 1.0600 1.0689 6.6067 6.6686 6.1509 1.0574 1.0630 1.0625 1.0324 1.0555 1.0608 1.0790 1.0980 1.1036 1.1073 1.1039 1.0875 1.1049 1.0881 1.1043 1.0942 1.1040 1.0965 1.1016 1.0671
irintensity: 2.0282 2.0779 3.3457 2.0839 1.8340 3.1793 1.5348 2.6436 16.5305 1.0657 0.9450 1.2622 4.9531 5.0817 130.0257 72.7544 3.6754 2.4132 0.0542 0.8684 1.2752 5.9852 3.9554 19.7951 13.1699 0.6662 10.7530 49.7412 3.7928 24.6354 43.3906 44.6122 6.3051 1.6151 13.8190 20.6212 33.4564 21.3036 34.4894 10.2386 8.0317 0.9948 0.3793 1.0746 3.1406 43.9326 22.2644 4.1853 9.3323 0.7697 3.8182 2.1479 19.9935 19.5305 3.7683 15.8198 17.9092 71.1039 24.1021 162.1913 34.5613 33.2940 2.2618 14.2774 1.9697 3.8832 12.7038 12.0673 8.7873 30.5099 4.1144 23.4979 6.0048 12.3501 18.4110 8.7982 32.1151 48.0361 13.6220 155.2691 79.1215 16.5476 26.9647 2.0842 40.1279 11.0667 3.9380 9.2797 19.3836 3.8084 14.2458 3.2332 6.9831 6.2095 14.3890 2.2294 7.2530 7.3153 3.2870 9.6684 11.8656 34.4083
temp: 298.150 k
press: 1.00000 atm
elementType: 8 8 7 6 6 6 6 6 6 6 6 6 6 6 6 6 1 1 1 1 1 1 1 1 1 1 1 1 1 1 1 1 1 1 1 1
symmnumber: 1
zpe: 814127.2 jmol-1
zpe.correction: 0.310085 hartree
zpe.thermalcorrener: 0.325973 hartree
zpe.thermalcorrenthalpy: 0.326917 hartree
zpe.thermalcorrgfe: 0.266163 hartree
zpe.sumelectzpe: -711.087653 hartree
zpe.sumelectthermal: -711.071765 hartree
zpe.sumelectthermalent: -711.070821 hartree
zpe.sumelectthermalfe: -711.131574 hartree
dipole: -8.7690 2.7180 0.2840
dipole: 9.1850
quadrupole: -20.4507 -83.0347 -86.3033
quadrupole: 5.7156 -4.1180 4.9226
quadrupole: 42.8122 -19.7718 -23.0404 5.7156 -4.1180 4.9226
hfenergy: -711.3977372 hartree
pointgroup: C01 [X(C13H20N1O2)]
dipole: -3.4247833 -1.1503679 0.0767856 debye
polarizability: 210.027381|-3.7354107|133.9185506|10.8073827|-19.727352|111.3209472 unknown
InChI: InChI=1S/C13H20NO2/c1-14(2,10-11-15)9-8-13(16)12-6-4-3-5-7-12/h3-7,15H,8-11H2,1-2H3
charge 1 multiplicity 1
36 atoms
O  -4.259276 0.71595 1.674655
O  0.572312 1.446635 -1.103258
N  -2.74651 -0.822516 -0.38682
C  -1.573146 0.128679 -0.06995
C  -4.03925 0.008232 -0.638548
C  -2.974941 -1.802589 0.769058
C  -2.479704 -1.613499 -1.667428
C  -0.195854 -0.534941 0.092083
C  -4.277221 1.199334 0.292673
C  0.910279 0.451995 -0.39348
C  2.326042 0.174149 -0.040419
C  2.72372 -0.970823 0.707613
C  3.319089 1.094479 -0.485934
C  4.084364 -1.188369 1.002747
C  4.675994 0.876166 -0.185942
C  5.061682 -0.265441 0.559294
H  -1.512828 0.86434 -0.893313
H  -1.852901 0.652194 0.857501
H  -3.976003 0.383141 -1.674945
H  -4.873993 -0.709053 -0.564697
H  -3.75347 -2.522508 0.470874
H  -2.033664 -2.335311 0.969178
H  -3.30757 -1.227657 1.644074
H  -2.120073 -0.926997 -2.449241
H  -1.729037 -2.393121 -1.476673
H  -3.418371 -2.091831 -1.987588
H  -0.008358 -0.828569 1.13808
H  -0.082004 -1.448165 -0.523779
H  -3.523344 1.995256 0.136401
H  -5.268202 1.611411 0.012874
H  -4.617384 1.398951 2.293783
H  1.985382 -1.698902 1.060796
H  2.999483 1.968153 -1.062919
H  4.386566 -2.070019 1.576842
H  5.433799 1.587842 -0.528316
H  6.117989 -0.4349 0.793323
