program: Gaussian 09
title: 000213560
version: EM64L-G09RevD.01
frameworkgroup: C1[X(C13H24N6)]
method: RPBEPBE
basis: SDD
operation: Freq
keyword: #pfreq=noraman
keyword: PBEPBE/SDD
title: #p freq=noraman PBEPBE/SDD
converged: YES YES NO NO
title: Mulliken charges:
elementType: N N N N N N C C C C C C C C C C C C C H H H H H H H H H H H H H H H H H H H H H H H H
charge: -0.377494 -0.153200 -0.154750 -0.346740 -0.155450 -0.593966 -0.029258 -0.429692 -0.465203 -0.395129 -0.412673 -0.375994 0.086161 -0.337503 -0.401330 0.113434 -0.328310 0.019083 -0.693684 0.241988 0.241932 0.186565 0.200220 0.216474 0.207449 0.198025 0.205541 0.188477 0.190337 0.200291 0.317117 0.184608 0.191972 0.246596 0.213029 0.197846 0.214614 0.308304 0.206909 0.216735 0.204974 0.325792 0.325907
chargesum: 0.00000
title: Mulliken charges with hydrogens summed into heavy atoms:
elementType: N N N N N N C C C C C C C C C C C C C
charge: -0.060377 -0.153200 -0.154750 -0.038436 -0.155450 0.057732 0.212730 -0.001195 -0.048510 0.010344 -0.018655 0.014633 0.086161 0.039077 0.058294 0.113434 0.084151 0.019083 -0.065067
polarizability: 2.22301552e+02 3.22441054e+00 2.03379347e+02 -3.68837515e+00 2.01403930e+01 1.42007932e+02
1716.lowfreq: -7.7609 -5.8642 -0.0007 -0.0006 -0.0005 8.5492 19.7631 34.2989 41.6799
frequency: 19.7229 34.2679 40.5060 54.8411 68.0925 75.4016 111.9603 125.9907 155.5605 178.1686 187.5764 211.9360 219.5715 239.8341 247.9610 261.1240 297.2207 324.5406 362.1886 375.9964 431.3894 437.6803 453.8164 466.7275 484.5494 516.7241 531.2988 540.2268 556.3764 584.6070 622.8775 644.7434 703.4771 706.5809 711.9662 737.1165 776.0700 790.1001 796.8692 818.2531 833.6737 848.0940 860.3081 871.2763 895.5924 925.8147 940.5499 953.3105 979.3121 990.0992 1011.2629 1026.8902 1043.7449 1051.7355 1059.4279 1084.9951 1087.1791 1110.9564 1114.8549 1145.1112 1157.0652 1169.3857 1170.4014 1227.0376 1239.1731 1244.6454 1249.4682 1256.6045 1271.9190 1288.1249 1294.5587 1308.2325 1318.3424 1329.2010 1335.1376 1342.1911 1344.7096 1352.2122 1355.9673 1361.2825 1374.4920 1381.7389 1388.5473 1445.5084 1456.6609 1457.8673 1459.4531 1465.3915 1467.2723 1471.4949 1473.5391 1476.9718 1479.1225 1485.7701 1513.1593 1518.8585 1522.5937 1569.9141 1620.8170 2955.2145 2959.8146 2963.8219 2969.4896 2971.0169 2975.3021 2976.9546 2980.1932 2980.6643 3006.1127 3015.7565 3025.6678 3028.3002 3034.5842 3037.2415 3043.0666 3051.4980 3067.4683 3070.1375 3077.8781 3557.0849 3561.2680 3563.8696 3723.1307
redmass: 3.6188 4.1609 3.6019 3.8617 3.0486 1.7393 3.3211 4.0713 4.2110 4.4162 6.1194 3.1339 2.8913 1.1687 2.6489 2.2981 2.6907 2.4972 2.1577 2.4512 3.1783 1.2074 2.8267 2.9790 2.1066 2.4222 1.0630 1.1468 6.1176 1.2165 2.6603 5.0975 9.0805 9.4565 3.7288 1.1677 1.5241 11.1835 3.3687 2.0868 1.8209 1.4355 2.2118 2.0934 11.0075 1.4078 1.4943 2.5266 1.9648 2.3048 2.5427 2.9685 1.5999 1.6983 2.1532 2.1413 1.6625 1.0597 2.0044 2.1782 2.0701 2.4345 2.5184 1.6061 2.1385 1.4124 1.4439 1.3012 1.3457 1.1186 1.7607 1.2875 1.4931 1.3203 1.4278 1.4735 1.4849 1.4668 1.6468 1.5170 1.7217 1.9336 1.2146 2.2542 1.0921 1.0903 1.0934 1.1270 1.1404 1.0936 1.0713 1.1401 1.0425 1.0780 2.5445 2.7507 7.1425 2.2053 2.5550 1.0602 1.0664 1.0610 1.0362 1.0650 1.0619 1.0659 1.0629 1.0625 1.0976 1.0853 1.0950 1.0971 1.1016 1.1016 1.1013 1.0998 1.1011 1.0991 1.0951 1.0757 1.0462 1.0745 1.1058
irintensity: 0.0005 0.0440 0.3140 1.5893 0.4976 0.1283 4.3627 0.5938 8.0581 0.6830 0.3231 0.6632 0.8429 0.0193 0.5899 3.2111 0.2127 0.9642 0.1538 1.3502 6.7613 255.3326 7.2925 0.7708 1.9676 17.6281 20.7009 90.2559 6.0492 117.9856 10.3022 3.9697 1.5901 2.0846 3.5722 9.1127 1.3868 39.4386 5.0728 1.9823 3.3616 2.9352 9.4287 9.1866 0.9750 7.2403 14.7544 0.7559 4.2680 5.1906 11.6302 1.2149 0.5390 0.5165 1.1094 2.4389 2.4827 0.1684 8.1100 12.3911 10.9167 1.3247 18.9949 14.6890 1.2572 8.1252 26.9047 4.0258 20.9682 4.4787 5.4410 6.5845 13.2012 0.6347 0.5925 29.5952 4.6002 0.9444 34.0131 8.2107 9.3055 18.3209 14.1611 101.8640 23.4468 16.6048 2.2459 34.9818 61.5291 0.7830 20.6199 73.9896 10.7911 15.9460 172.4965 333.3183 1380.0099 839.7752 66.8940 20.5159 25.7917 42.7812 54.0413 21.2922 30.5941 26.7059 93.6221 49.3766 19.5182 40.8371 84.2748 54.9163 14.4215 21.5568 63.6220 72.5689 78.1907 44.4855 15.9206 46.9500 99.3360 45.3350 42.1407
temp: 298.150 k
press: 1.00000 atm
elementType: 7 7 7 7 7 7 6 6 6 6 6 6 6 6 6 6 6 6 6 1 1 1 1 1 1 1 1 1 1 1 1 1 1 1 1 1 1 1 1 1 1 1 1
symmnumber: 1
zpe: 980809.1 jmol-1
zpe.correction: 0.373570 hartree
zpe.thermalcorrener: 0.393133 hartree
zpe.thermalcorrenthalpy: 0.394077 hartree
zpe.thermalcorrgfe: 0.324173 hartree
zpe.sumelectzpe: -836.861103 hartree
zpe.sumelectthermal: -836.841541 hartree
zpe.sumelectthermalent: -836.840597 hartree
zpe.sumelectthermalfe: -836.910501 hartree
dipole: -0.3194 -0.6700 -0.0687
dipole: 0.7454
quadrupole: -102.5596 -106.9102 -115.4326
quadrupole: 0.9903 -0.4228 7.0240
quadrupole: 5.7412 1.3906 -7.1318 0.9903 -0.4228 7.0240
hfenergy: -837.2346735 hartree
pointgroup: C01 [X(C13H24N6)]
dipole: 0.0738996 0.283088 0.0202571 debye
polarizability: 218.853904|5.9292691|209.3749799|14.1615743|-8.6965834|139.4599469 unknown
InChI: InChI=1S/C13H24N6/c1-2-3-9-15-12-17-11(14)18-13(19-12)16-10-7-5-4-6-8-10/h10,15-16H,2-9,14H2,1H3
charge 0 multiplicity 1
43 atoms
N  1.7920 -0.492362 -0.31013
N  -0.507857 -0.504909 -0.819409
N  0.634358 -2.483191 0.061062
N  -2.81573 -0.681778 -1.293275
N  -1.755616 -2.576953 -0.450719
N  -0.612488 -4.436105 0.395606
C  1.969343 0.918493 -0.711511
C  1.444386 1.901135 0.373918
C  3.466785 1.183941 -1.008134
C  2.310032 1.871321 1.65394
C  4.342092 1.172301 0.271593
C  3.797711 2.158277 1.333823
C  0.601235 -1.170857 -0.35892
C  -3.832622 1.570145 -0.798944
C  -2.952362 0.710236 -1.740088
C  -1.652794 -1.260639 -0.842879
C  -3.231954 1.753839 0.612459
C  -0.575986 -3.123125 -0.011317
C  -4.139356 2.586835 1.542518
H  1.372194 1.068334 -1.630566
H  0.391548 1.650657 0.597737
H  1.455097 2.924197 -0.056623
H  3.545085 2.182664 -1.481096
H  3.839325 0.446802 -1.74587
H  2.221356 0.874289 2.131532
H  1.927305 2.608574 2.385812
H  5.386079 1.428543 0.00691
H  4.378487 0.151399 0.70714
H  3.893052 3.194418 0.946781
H  4.408948 2.102126 2.255368
H  2.584919 -1.02976 0.042799
H  -4.842864 1.115965 -0.715867
H  -3.975984 2.562639 -1.274531
H  -1.931453 1.124483 -1.791894
H  -3.379467 0.723899 -2.763334
H  -2.238889 2.238531 0.521849
H  -3.048813 0.757953 1.06054
H  -3.632345 -1.295399 -1.279005
H  -5.125427 2.101833 1.674335
H  -3.687217 2.707507 2.544153
H  -4.316745 3.597695 1.127966
H  -1.49255 -4.941863 0.352378
H  0.242681 -4.874293 0.725492
