program: Gaussian 09
title: 000214146
version: EM64L-G09RevD.01
frameworkgroup: C1[X(C17H28ClNO)]
method: RPBEPBE
basis: SDD
operation: Freq
keyword: #p
keyword: freq=noraman
keyword: PBEPBE/SDD
title: #p freq=noraman PBEPBE/SDD
converged: YES YES NO NO
title: Mulliken charges:
elementType: Cl O N C C C C C C C C C C C C C C C C C H H H H H H H H H H H H H H H H H H H H H H H H H H H H
charge: -0.084282 -0.292765 -0.075968 -0.234398 -0.059775 -0.439002 -0.400425 0.443456 -0.752637 0.232203 -0.717533 -0.414872 -0.637376 -0.616511 -0.361179 -0.124635 -0.250745 -0.252247 -0.396955 -0.676970 0.220387 0.238904 0.239268 0.195069 0.193986 0.212307 0.236043 0.206170 0.207684 0.217397 0.223571 0.213512 0.257775 0.243263 0.183161 0.219173 0.221825 0.184118 0.220300 0.246381 0.249612 0.200069 0.203990 0.216456 0.212575 0.211164 0.227433 0.211024
chargesum: 0.00000
title: Mulliken charges with hydrogens summed into heavy atoms:
elementType: Cl O N C C C C C C C C C C C C C C C C C
charge: -0.084282 -0.292765 -0.075968 -0.014011 0.179130 -0.004665 0.005868 0.443456 -0.102739 0.232203 -0.063052 -0.157098 0.008221 0.009732 -0.114799 -0.124635 -0.001133 0.151811 0.032075 -0.027349
polarizability: 2.44514531e+02 -4.88813305e+00 2.12868187e+02 9.98858618e-01 -9.88024960e-01 1.62250724e+02
1716.lowfreq: -18.7014 -10.1067 -8.2613 -0.0021 -0.0008 0.0009 13.2924 27.1539 37.9685
frequency: -8.2668 26.7526 37.7313 40.1408 60.3356 63.7991 70.7628 80.6449 105.0162 123.6553 126.7447 154.0102 166.0176 196.5351 201.2269 214.1922 221.2694 224.3928 231.9552 240.1548 249.4865 260.3749 283.4216 289.1680 323.7172 352.4136 358.7946 360.3906 404.8511 426.2146 448.2770 459.4585 480.4596 514.6304 538.2258 583.3556 637.2068 654.6585 722.2247 745.1407 767.5033 771.3604 794.1397 802.3052 820.7772 833.3251 885.8188 895.9858 903.1207 918.4498 921.1431 972.3480 975.0085 980.9350 982.1255 1008.2069 1025.4947 1033.4694 1052.9784 1070.1846 1084.5624 1090.2946 1099.7002 1119.7211 1134.9776 1136.3124 1141.0228 1141.1458 1156.3850 1183.2891 1196.8399 1222.6395 1228.5786 1230.5742 1260.0276 1267.2594 1274.1856 1285.5048 1290.9444 1302.5758 1308.1464 1329.6313 1338.7707 1350.5933 1363.9073 1375.1650 1383.7498 1385.7008 1389.2039 1394.4808 1402.2484 1415.6628 1436.6289 1457.8077 1458.9470 1466.7437 1469.2855 1472.4132 1474.3284 1475.5501 1476.3153 1480.3581 1480.7280 1483.2532 1484.4930 1488.1026 1489.1421 1493.0379 1584.1271 1595.3647 2831.3552 2835.0008 2853.2848 2944.8109 2964.7058 2970.7359 2972.8635 2977.6311 2978.7824 2999.0937 2999.8833 3002.5420 3011.3897 3020.3900 3025.7624 3050.1494 3052.5749 3060.8553 3065.6873 3071.7454 3074.9880 3079.1505 3080.4919 3081.7715 3084.3873 3145.4765 3157.3993 3177.0982
redmass: 3.5713 3.0964 4.0354 3.8903 2.3007 2.4419 2.9762 3.0482 3.9585 2.5918 2.8305 3.2203 3.5923 1.9077 2.3512 1.2565 1.2212 1.1614 1.1514 2.1146 2.0929 4.7838 3.1279 2.7011 2.8535 5.0000 2.0141 3.3474 2.7413 4.4992 2.6370 3.2361 2.9064 3.3830 3.1389 4.2501 6.4083 3.9570 3.3422 3.7591 1.1076 1.3027 1.9831 2.0396 4.0228 3.1583 1.4552 1.1571 1.7177 1.6111 1.3850 2.0959 1.7865 3.7039 2.2180 1.7696 1.8067 1.5069 2.7867 2.4349 2.1040 1.3675 2.0748 1.9303 2.2193 1.5133 1.4854 1.9426 1.8722 2.2017 2.2178 3.3174 1.3570 1.2649 2.2300 1.5114 1.2580 1.1040 1.4094 1.4052 1.3542 1.4022 1.4506 1.3496 1.5653 1.8609 1.7549 1.3838 1.2368 1.2646 2.7872 1.1421 1.1530 1.0978 1.0561 1.1230 1.3298 1.0772 1.0610 1.2399 1.0543 1.0421 1.0506 1.1617 1.0573 1.0566 1.0667 1.1673 7.1378 7.3843 1.0579 1.0664 1.0616 1.0552 1.0784 1.0511 1.0444 1.0420 1.0363 1.0821 1.0626 1.1056 1.0709 1.0987 1.0705 1.1020 1.0883 1.0986 1.0989 1.1007 1.0995 1.1026 1.0984 1.1002 1.0988 1.0918 1.0875 1.0965
irintensity: 0.1820 0.0126 0.0124 0.2381 0.1922 0.5647 0.0930 0.0541 0.1368 0.3807 0.0976 2.5875 1.9059 0.0781 0.0470 0.2627 0.0056 0.1107 0.3633 0.5891 0.1571 3.6243 2.7170 0.5764 1.5300 3.2430 8.4345 1.8144 0.5865 2.1243 0.6237 1.8770 2.3519 11.2832 3.4162 1.8085 13.8966 34.1224 2.3785 10.1915 14.8357 12.6279 16.3809 23.1023 15.1344 15.6586 19.2119 1.2807 9.1473 6.1478 0.7973 40.3781 3.8668 46.4984 5.3539 5.3919 35.2881 15.4253 4.6173 14.6498 5.0602 0.5090 17.3752 56.5990 2.3397 20.4165 1.1871 11.0447 9.5389 107.5372 12.4257 98.5871 13.0343 0.6711 9.4969 2.7968 0.3934 0.0319 11.6060 0.0712 0.3909 3.5648 5.5585 3.3142 1.3238 0.3414 13.3579 7.7688 32.7187 26.9422 7.7722 4.3873 1.4755 7.3508 8.6265 47.8913 70.5890 3.8193 1.6348 31.1951 15.1243 11.9743 29.5637 26.4904 25.1897 1.1112 13.0389 1.3274 2.1301 6.2137 78.9930 63.8199 298.2389 41.9264 13.2003 27.7600 28.7384 48.1726 33.4880 24.8612 20.8031 22.4611 42.9300 22.1230 36.5526 1.5178 8.6253 35.2692 79.2040 37.5313 51.2191 79.2568 30.7529 50.9760 39.7797 5.4659 6.7335 7.6522
temp: 298.150 k
press: 1.00000 atm
elementType: 17 8 7 6 6 6 6 6 6 6 6 6 6 6 6 6 6 6 6 6 1 1 1 1 1 1 1 1 1 1 1 1 1 1 1 1 1 1 1 1 1 1 1 1 1 1 1 1
symmnumber: 1
zpe: 1086884.6 jmol-1
zpe.correction: 0.413972 hartree
zpe.thermalcorrener: 0.436975 hartree
zpe.thermalcorrenthalpy: 0.437920 hartree
zpe.thermalcorrgfe: 0.361081 hartree
zpe.sumelectzpe: -1253.029799 hartree
zpe.sumelectthermal: -1253.006796 hartree
zpe.sumelectthermalent: -1253.005852 hartree
zpe.sumelectthermalfe: -1253.082691 hartree
dipole: -4.1046 -0.5014 0.1480
dipole: 4.1378
quadrupole: -135.8340 -120.3387 -130.7734
quadrupole: 8.6982 0.8031 1.9917
quadrupole: -6.8519 8.6433 -1.7914 8.6982 0.8031 1.9917
hfenergy: -1253.4437718 hartree
pointgroup: C01 [X(C17H28Cl1N1O1)]
dipole: 0.9664465 -1.3063168 0.0984351 debye
polarizability: 216.3260808|-11.0709144|241.0276652|1.7485903|0.0040785|162.2796954 unknown
InChI: InChI=1S/C17H28ClNO/c1-6-10-20-17-9-8-14(18)11-15(17)16(12-19(4)5)13(3)7-2/h8-9,11,13,16H,6-7,10,12H2,1-5H3
charge 0 multiplicity 1
48 atoms
Cl -1.184036 4.809157 -0.170416
O  1.554244 -0.570144 -0.224407
N  -0.925639 -0.685185 2.349528
C  -1.340845 -0.514656 -0.156751
C  -1.243418 -1.317675 -1.505681
C  -1.033994 -1.422826 1.069849
C  -2.109423 -2.613672 -1.510891
C  -0.468136 0.742086 -0.169207
C  -1.591657 -0.417547 -2.717014
C  0.960515 0.706599 -0.197087
C  -3.624973 -2.41032 -1.281072
C  -1.088039 2.012335 -0.16601
C  -2.195417 -0.074499 2.783064
C  -0.317523 -1.512075 3.409238
C  1.719681 1.900906 -0.206043
C  -0.322305 3.194138 -0.17853
C  1.078886 3.161143 -0.194922
C  3.025347 -0.656748 -0.203899
C  3.390371 -2.143608 -0.202686
C  4.920394 -2.354467 -0.183038
H  -2.390852 -0.165571 -0.074432
H  -0.186841 -1.635372 -1.613058
H  -0.068553 -1.927579 0.893019
H  -1.826463 -2.21314 1.133257
H  -1.961318 -3.106595 -2.49369
H  -1.72133 -3.322898 -0.754282
H  -0.887242 0.427354 -2.80937
H  -2.609362 0.008777 -2.629804
H  -1.550048 -1.000396 -3.65652
H  -3.833835 -1.97671 -0.285169
H  -4.067037 -1.740545 -2.04062
H  -4.159225 -3.376647 -1.338495
H  -2.181283 2.073789 -0.15514
H  -2.532782 0.673858 2.045715
H  -3.019398 -0.822587 2.924079
H  -2.042779 0.451474 3.742405
H  0.67031 -1.875772 3.073202
H  -0.934686 -2.404251 3.69382
H  -0.167602 -0.901587 4.31828
H  2.812348 1.872243 -0.220707
H  1.66475 4.084553 -0.200728
H  3.444006 -0.149201 -1.098726
H  3.416333 -0.152334 0.704647
H  2.950462 -2.621078 -1.098229
H  2.927302 -2.624679 0.679451
H  5.378451 -1.905233 0.718119
H  5.166369 -3.430893 -0.182762
H  5.401774 -1.900714 -1.069686
