program: Gaussian 09
title: 000212279
version: EM64L-G09RevD.01
frameworkgroup: C1[X(C15H11Cl2N5O2)]
method: RPBEPBE
basis: SDD
operation: Freq
keyword: #p
keyword: freq=noraman
keyword: PBEPBE/SDD
title: #p freq=noraman PBEPBE/SDD
converged: YES YES NO NO
title: Mulliken charges:
elementType: Cl Cl O O N N N N N C C C C C C C C C C C C C C C H H H H H H H H H H H
charge: -0.058372 -0.054740 -0.360328 -0.276991 -0.494042 -0.031119 -0.111005 -0.354490 0.012132 0.051292 0.317810 0.142334 0.531116 -0.295505 -0.343541 -0.250170 -0.237014 -0.370246 -0.310641 -0.460961 -0.023537 -0.056736 -0.280492 0.140876 0.286263 0.388844 0.264528 0.238643 0.262069 0.246572 0.234477 0.339290 0.260158 0.282556 0.370968
chargesum: 0.00000
title: Mulliken charges with hydrogens summed into heavy atoms:
elementType: Cl Cl O O N N N N N C C C C C C C C C C C C C C C
charge: -0.058372 -0.054740 -0.360328 -0.276991 -0.105198 -0.031119 -0.111005 0.016478 0.012132 0.051292 0.317810 0.142334 0.531116 -0.009243 -0.079014 -0.011527 -0.002537 0.138396 0.028650 -0.200802 -0.023537 -0.056736 0.002064 0.140876
polarizability: 3.21325979e+02 2.49573512e+01 2.77050324e+02 -2.88905675e+00 1.06275574e+01 1.06567834e+02
1716.lowfreq: -2.7695 -2.4760 0.0010 0.0028 0.0030 1.5830 12.9552 19.4204 26.4953
frequency: 12.9323 19.4186 26.4801 40.1700 44.4337 71.1696 81.9581 125.1928 127.6003 145.1665 161.6154 167.8027 206.1908 208.9990 233.0914 243.1747 267.0742 280.9913 341.5417 355.8803 374.5274 409.1802 426.2810 440.1127 462.8643 506.6101 515.5055 521.3395 570.5036 571.9195 600.2806 647.7450 661.5232 672.0933 678.6878 679.0436 734.9536 748.8037 751.9881 765.9525 774.7441 790.4114 810.1287 843.8219 865.8533 872.9564 873.7835 893.3777 905.3871 924.6404 941.6306 952.7102 967.9127 971.5944 975.6685 1003.4427 1006.5059 1046.4769 1076.0645 1093.8993 1104.8691 1108.5124 1126.5129 1153.7031 1170.2491 1179.3028 1208.3046 1230.5812 1254.3845 1275.7237 1283.5251 1293.1270 1353.7591 1370.8920 1380.3997 1403.9829 1411.0968 1434.1477 1449.9086 1456.3206 1458.7474 1472.9923 1525.4110 1566.4212 1583.6079 1599.9295 1607.9581 1625.9945 3040.1848 3117.6934 3139.5778 3153.1850 3154.9664 3168.5909 3178.9705 3191.9319 3202.3573 3358.6353 3597.2763
redmass: 13.4318 9.2389 9.5890 8.2522 8.1897 7.0049 8.8985 9.5157 4.7522 9.7645 8.8539 8.3246 4.8100 6.4887 9.0235 6.6260 7.9079 4.9812 5.2144 2.7006 13.5266 7.4650 6.9112 3.6393 6.8013 7.8080 5.3264 3.8752 6.5336 4.7334 5.4248 9.9158 6.3406 3.2085 3.1251 5.0474 1.1618 7.6906 3.0880 6.3733 1.4574 8.4355 1.2778 1.4179 3.7321 1.8002 1.4759 5.8277 7.3287 1.3768 2.5050 7.9979 1.4641 4.6014 5.9437 1.3384 9.9790 2.5506 3.5264 1.5881 1.7780 6.5541 1.8831 7.2672 2.3052 1.1853 2.3881 2.3939 1.2856 2.4083 1.6665 1.4602 1.2282 6.0542 8.8818 1.6258 3.7650 2.3539 3.4784 7.8101 1.1311 2.3253 3.0946 8.4840 4.5371 6.2142 5.5233 2.9045 1.0610 1.1046 1.0864 1.0904 1.0930 1.0952 1.0981 1.0940 1.0936 1.0801 1.0850
irintensity: 0.1436 0.7928 2.3071 0.8592 1.7454 0.2013 4.7654 0.9673 1.0737 1.0737 0.6761 2.5550 0.0926 1.3518 0.5353 1.7412 2.3711 0.7915 15.0164 2.4637 15.7801 7.9445 1.6543 2.3137 4.0732 20.2175 0.1187 3.6091 8.0000 0.6041 23.9842 6.2127 0.6485 23.3457 0.4241 22.4519 123.7689 63.9489 22.9078 17.6509 85.6081 20.5581 34.4498 26.9061 21.8320 32.2174 35.8980 4.4728 36.1089 31.7018 0.7988 85.4987 7.8669 27.7917 15.8359 1.0691 0.6782 40.6897 34.7184 9.9634 28.4220 13.9773 32.3936 4.1582 90.5154 7.0337 39.3395 88.9597 8.3484 14.4695 85.5137 22.7053 3.8549 66.9512 19.3271 15.5112 44.2469 59.7312 79.9211 0.7862 46.9814 64.3643 450.3592 178.0137 201.0033 217.5156 42.7839 128.7829 22.9145 1.4991 4.4182 3.6996 2.0229 14.0259 13.0863 3.0673 19.5079 293.9973 124.0885
temp: 298.150 k
press: 1.00000 atm
elementType: 17 17 8 8 7 7 7 7 7 6 6 6 6 6 6 6 6 6 6 6 6 6 6 6 1 1 1 1 1 1 1 1 1 1 1
symmnumber: 1
zpe: 639317.5 jmol-1
zpe.correction: 0.243503 hartree
zpe.thermalcorrener: 0.264220 hartree
zpe.thermalcorrenthalpy: 0.265164 hartree
zpe.thermalcorrgfe: 0.189528 hartree
zpe.sumelectzpe: -1920.791569 hartree
zpe.sumelectthermal: -1920.770852 hartree
zpe.sumelectthermalent: -1920.769908 hartree
zpe.sumelectthermalfe: -1920.845544 hartree
dipole: -9.4845 1.2287 1.1023
dipole: 9.6270
quadrupole: -124.1495 -162.7250 -150.5269
quadrupole: 0.0163 3.8420 1.8948
quadrupole: 21.6510 -16.9246 -4.7264 0.0163 3.8420 1.8948
hfenergy: -1921.0350722 hartree
pointgroup: C01 [X(C15H11Cl2N5O2)]
dipole: -2.8583045 2.4653509 -0.3127385 debye
polarizability: 323.5685027|-8.1411408|267.6705922|40.5151638|-9.0504228|113.7050422 unknown
InChI: InChI=1S/C15H11Cl2N5O2/c16-9-5-10(17)7-11(6-9)18-15(23)12-3-1-2-4-13(12)24-8-14-19-21-22-20-14/h1-7,18,21H,8H2
charge 0 multiplicity 1
35 atoms
Cl 5.275504 0.80528 1.193798
Cl 4.354137 -4.653621 0.74964
O  -1.191722 0.971162 0.438949
O  -0.429257 -3.191107 0.017434
N  0.507908 -1.066396 0.345297
N  -2.632905 3.680642 -1.022653
N  -0.345363 3.869061 -0.890801
N  -2.111414 4.500838 -1.980325
N  -0.72624 4.641294 -1.935343
C  -1.917431 -1.28375 -0.087472
C  -2.246468 0.10028 0.053552
C  -0.559241 -1.928728 0.100925
C  1.868648 -1.399474 0.536401
C  -2.964913 -2.172683 -0.442847
C  -3.561186 0.565621 -0.17704
C  -4.281869 -1.725823 -0.658019
C  -4.576079 -0.350427 -0.528727
C  -1.478753 2.369534 0.822264
C  2.354017 -2.737425 0.538512
C  2.77168 -0.315559 0.736334
C  4.131554 -0.591138 0.93769
C  3.727967 -2.94169 0.744768
C  4.653776 -1.899524 0.949722
C  -1.501018 3.295871 -0.354126
H  -2.694646 -3.229628 -0.536069
H  0.252798 -0.068655 0.403848
H  -3.799526 1.630629 -0.122055
H  -5.066884 -2.43822 -0.929251
H  -0.638111 2.642993 1.478077
H  -2.422758 2.422312 1.390834
H  -5.591403 0.019915 -0.706949
H  1.662227 -3.565255 0.380995
H  2.414787 0.719038 0.724622
H  5.71627 -2.094376 1.107461
H  -2.686282 4.972409 -2.679348
