program: Gaussian 09
title: 000211402
version: EM64L-G09RevD.01
frameworkgroup: C1[X(C20H23NO4)]
method: RPBEPBE
basis: SDD
operation: Freq
keyword: #p
keyword: freq=noraman
keyword: PBEPBE/SDD
title: #p freq=noraman PBEPBE/SDD
converged: YES YES NO NO
title: Mulliken charges:
elementType: O O O O N C C C C C C C C C C C C C C C C C C C C H H H H H H H H H H H H H H H H H H H H H H H
charge: -0.308111 -0.273115 -0.292180 -0.290400 -0.069480 -0.001085 -0.439380 -0.513899 -0.422747 -0.307947 -0.332171 0.217028 0.232042 -0.345435 -0.338667 0.232655 -0.228429 -0.247999 0.230908 -0.554315 -0.345127 -0.332910 -0.219345 -0.217526 -0.222571 0.232058 0.251764 0.250704 0.216285 0.247607 0.222497 0.227112 0.176558 0.221380 0.239144 0.221963 0.247645 0.237780 0.225896 0.222869 0.282512 0.214122 0.222294 0.264908 0.270757 0.232060 0.230642 0.231649
chargesum: 0.00000
title: Mulliken charges with hydrogens summed into heavy atoms:
elementType: O O O O N C C C C C C C C C C C C C C C C C C C C
charge: -0.308111 -0.273115 -0.292180 -0.290400 -0.069480 0.230973 0.063089 -0.050007 0.026862 0.089991 0.128936 0.217028 0.232042 -0.097789 -0.100887 0.232655 -0.002534 -0.025130 0.230908 0.164613 -0.080219 -0.062154 0.012715 0.013116 0.009078
polarizability: 2.95004091e+02 9.51491883e+00 2.44097681e+02 -1.34045425e+01 -4.88250701e+00 1.68173813e+02
1716.lowfreq: -19.8236 -4.7829 0.0007 0.0008 0.0010 4.0105 6.2485 13.4186 25.4729
frequency: -17.2576 13.2929 25.1411 27.5586 28.5733 59.1943 74.4991 85.2578 93.9854 112.0946 128.0099 148.0284 168.5100 184.8934 205.2186 225.5494 258.3356 266.7620 291.3440 309.2103 328.7161 342.9588 354.7510 370.9761 403.7078 411.4351 438.5661 458.9768 463.1376 503.5162 523.6518 536.4592 551.3325 589.0749 603.8549 614.1209 649.7025 656.6252 677.4064 700.0865 701.8695 726.6722 746.5386 751.5094 777.0486 792.2338 795.4479 834.9549 838.8133 848.4700 856.8085 863.8071 900.0427 919.2481 939.5582 944.3332 954.1158 961.4836 962.5270 981.8222 990.5895 995.4896 998.4195 1007.7515 1021.4372 1033.0358 1036.2260 1050.6813 1059.6075 1063.1309 1086.6676 1098.6264 1100.0405 1113.0141 1148.0941 1158.1910 1161.9660 1166.3494 1173.7150 1181.1534 1190.4700 1197.2219 1231.1991 1242.3786 1244.4086 1252.2788 1257.2348 1260.6726 1282.0194 1289.2404 1306.3858 1314.0707 1322.6066 1338.7335 1367.9302 1371.7556 1378.4153 1390.1814 1428.0449 1437.8780 1444.3555 1450.9915 1452.1463 1461.5275 1468.8967 1472.5753 1476.3294 1477.9713 1481.0349 1483.2081 1583.2382 1585.0010 1599.6664 1610.5791 1616.0205 2816.0944 2957.2734 2999.7994 3007.4774 3017.9873 3023.2748 3029.1146 3038.9845 3047.5775 3074.6263 3093.1013 3094.6338 3115.7352 3129.3904 3132.0067 3142.4945 3146.2952 3155.5092 3155.7649 3158.9564 3167.6703 3171.8204 3181.8383
redmass: 3.8787 5.5472 4.4559 4.3471 5.1715 4.4705 6.7871 3.3394 4.0054 3.3557 5.1581 4.1972 3.9997 4.3992 3.8928 2.7492 1.5168 3.7720 3.0732 3.1347 3.0034 3.5199 4.2166 2.5039 2.8212 2.4935 3.6495 3.2602 5.1902 3.5799 6.0462 3.2250 4.0464 4.3748 3.5584 6.4304 2.6428 6.1798 5.0192 1.6451 3.9378 4.0191 2.2243 1.6170 4.5206 3.8473 2.3177 2.9645 1.4712 2.8950 3.1245 1.2455 2.3641 1.3716 2.5430 3.3747 1.4319 2.2817 1.2975 8.6148 5.9059 1.3908 2.3450 1.3294 2.6054 2.2127 2.0203 2.8247 2.8885 2.1392 1.7309 2.2635 2.1038 1.2522 2.6490 1.4688 1.1489 1.2620 1.0571 1.1244 1.9950 1.2245 1.5320 3.4021 3.0797 1.2380 1.2256 1.4907 1.2777 1.3270 1.2202 1.3202 1.4595 1.3847 1.3024 1.3748 8.9494 10.1162 1.7121 2.2396 1.4231 1.0917 1.0998 1.0828 1.1011 1.2111 1.4466 1.3058 1.1832 1.9871 6.8613 7.1877 6.5516 6.4781 8.1168 1.0701 1.0317 1.0634 1.0654 1.0836 1.0729 1.0589 1.0861 1.1037 1.1015 1.1018 1.1067 1.1015 1.0855 1.0848 1.0893 1.0895 1.0941 1.0941 1.0940 1.0982 1.1002 1.0969
irintensity: 1.0541 0.2085 0.2619 0.6768 0.2398 2.6928 2.5467 5.3314 0.6802 0.6556 0.8625 0.3516 0.7268 2.7357 4.9990 1.2554 2.6085 1.5555 4.3097 0.9403 0.5537 10.3434 7.5728 9.5472 0.0271 1.5641 1.1998 4.1816 6.7066 0.3704 5.1882 6.7103 0.6055 4.5455 17.1560 0.6696 0.6862 5.7898 21.8660 88.9088 5.6970 8.6913 62.8206 58.8013 5.7172 14.0526 18.2829 2.8780 0.4624 4.8053 27.0679 0.1122 15.8062 3.5077 6.9602 67.7201 5.1370 1.9071 0.1720 39.5203 2.6893 0.0925 10.1881 0.3413 77.9564 10.8438 30.5903 47.3062 109.9934 61.6455 25.8506 32.8603 92.2031 0.2453 2.8051 34.7406 11.6715 0.4592 0.1777 41.6605 46.7120 6.0734 3.6074 334.8232 208.1081 15.4711 42.6382 6.5653 3.6757 12.4485 4.0559 2.0711 20.5688 22.5110 11.0330 7.2145 21.4582 3.3315 13.9386 14.8393 36.3799 17.6063 12.8439 5.1036 21.2300 84.4998 16.8114 14.1761 11.2370 109.5390 66.9430 12.5932 18.3033 21.8319 161.3218 113.8157 61.3153 46.5704 15.9622 35.5720 5.9972 44.0785 28.8752 46.2468 29.2313 27.6392 25.5950 1.9606 0.2704 0.4937 11.8643 17.7799 19.3426 6.9387 23.9174 20.9205 16.2348 7.1545
temp: 298.150 k
press: 1.00000 atm
elementType: 8 8 8 8 7 6 6 6 6 6 6 6 6 6 6 6 6 6 6 6 6 6 6 6 6 1 1 1 1 1 1 1 1 1 1 1 1 1 1 1 1 1 1 1 1 1 1 1
symmnumber: 1
zpe: 1024303.1 jmol-1
zpe.correction: 0.390136 hartree
zpe.thermalcorrener: 0.412557 hartree
zpe.thermalcorrenthalpy: 0.413501 hartree
zpe.thermalcorrgfe: 0.335598 hartree
zpe.sumelectzpe: -1129.683841 hartree
zpe.sumelectthermal: -1129.661420 hartree
zpe.sumelectthermalent: -1129.660476 hartree
zpe.sumelectthermalfe: -1129.738379 hartree
dipole: 1.3281 0.3838 1.7793
dipole: 2.2533
quadrupole: -134.9293 -127.6069 -145.6123
quadrupole: 0.9934 -8.7531 1.6880
quadrupole: 1.1202 8.4426 -9.5628 0.9934 -8.7531 1.6880
hfenergy: -1130.0739772 hartree
pointgroup: C01 [X(C20H23N1O4)]
dipole: -0.5412907 0.362242 -0.6014036 debye
polarizability: 289.1294289|-10.9187295|240.8323298|-23.5416555|23.4365578|177.3138266 unknown
InChI: InChI=1S/C20H23NO4/c1-23-18-9-5-6-10-19(18)25-17-11-12-21(15-17)13-14-24-20(22)16-7-3-2-4-8-16/h2-10,17H,11-15H2,1H3
charge 0 multiplicity 1
48 atoms
O  3.09595 0.380288 0.931023
O  -2.666627 1.776741 -0.667373
O  1.919179 -1.230046 -1.083315
O  -1.969772 -0.377374 -1.257504
N  -0.024877 2.160687 0.701671
C  2.24461 1.346843 0.166099
C  0.727933 0.958905 0.251119
C  2.329788 2.717726 0.890801
C  0.945619 2.852959 1.603555
C  -0.542535 3.049358 -0.365286
C  -1.493792 2.368823 -1.35962
C  3.823024 -0.60767 0.242848
C  3.264728 -1.461071 -0.761907
C  5.159097 -0.811321 0.650193
C  4.060131 -2.475805 -1.3439
C  -2.763572 0.383415 -0.643353
C  5.947202 -1.835966 0.077792
C  5.398337 -2.663049 -0.925507
C  -3.926699 -0.078607 0.168217
C  1.235088 -2.169869 -1.976054
C  -4.204568 -1.469888 0.205334
C  -4.741692 0.826294 0.896649
C  -5.291635 -1.952389 0.962171
C  -5.828386 0.338588 1.652581
C  -6.106054 -1.048903 1.686396
H  2.624166 1.384233 -0.869922
H  0.332896 0.546468 -0.683573
H  0.641218 0.167859 1.01788
H  2.463304 3.531624 0.154262
H  3.186285 2.734878 1.584206
H  0.639386 3.896033 1.792769
H  0.96733 2.315741 2.570315
H  0.258539 3.518676 -0.999112
H  -1.079817 3.878503 0.132634
H  -0.99823 1.577604 -1.947683
H  -1.908676 3.129151 -2.0437
H  5.557077 -0.154241 1.430124
H  3.636356 -3.128853 -2.113359
H  6.980135 -1.97924 0.411748
H  6.001279 -3.455377 -1.382027
H  0.187924 -1.829704 -1.988209
H  1.659823 -2.135256 -2.998584
H  1.293087 -3.20384 -1.584476
H  -3.559001 -2.149241 -0.360866
H  -4.509745 1.89408 0.865941
H  -5.504852 -3.026419 0.990226
H  -6.456443 1.036089 2.217347
H  -6.950414 -1.424237 2.275633
