program: Gaussian 09
title: 000210821
version: EM64L-G09RevD.01
frameworkgroup: C1[X(C20H24N2S)]
method: RPBEPBE
basis: SDD
operation: Freq
keyword: #p
keyword: freq=noraman
keyword: PBEPBE/SDD
title: #p freq=noraman PBEPBE/SDD
converged: YES YES NO NO
title: Mulliken charges:
elementType: S N N C C C C C C C C C C C C C C C C C C C C H H H H H H H H H H H H H H H H H H H H H H H H
charge: 0.199218 -0.106996 -0.169302 -0.121796 -0.382826 -0.350909 -0.472670 -0.412994 -0.399780 0.530500 -0.321069 -0.406878 -0.689025 0.472202 -0.449416 -0.246466 -0.238728 -0.376793 -0.380432 -0.243654 -0.236785 -0.228338 -0.270220 0.184570 0.191816 0.212542 0.234460 0.184875 0.213301 0.222609 0.208994 0.211956 0.201946 0.225568 0.196184 0.242359 0.257542 0.253715 0.238033 0.257778 0.229889 0.229653 0.215743 0.231595 0.216463 0.217462 0.224100
chargesum: 0.00000
title: Mulliken charges with hydrogens summed into heavy atoms:
elementType: S N N C C C C C C C C C C C C C C C C C C C C
charge: 0.199218 -0.106996 -0.169302 0.062775 0.021533 0.068426 -0.036759 0.007956 0.027734 0.530500 0.117474 -0.406878 -0.177768 0.472202 -0.211383 0.011312 -0.008839 -0.147139 -0.164689 -0.012058 -0.020322 -0.010877 -0.046121
polarizability: 3.01120291e+02 -2.17366697e+01 2.48189861e+02 -8.56628015e+00 8.00991655e-01 1.84075940e+02
1716.lowfreq: -18.3254 -6.3626 -2.3947 -0.0020 -0.0017 -0.0016 18.4806 24.8352 47.2913
frequency: 17.0694 24.8268 47.2828 52.3170 63.8716 89.2749 111.9485 143.9728 148.1775 202.2639 213.1695 233.9688 242.1343 261.9666 278.5584 298.5025 314.5004 317.7521 350.1684 394.3603 407.8475 414.8412 432.4789 435.1775 456.8441 471.3863 494.7785 513.6268 564.2786 567.3710 606.4986 614.2511 620.9102 643.1980 661.7942 688.4376 720.1685 744.6078 755.3018 764.0005 765.6536 787.5684 810.9643 837.2181 848.2464 868.1035 871.1292 884.6519 916.5582 926.3192 953.9692 955.9993 961.1385 968.3553 974.4584 977.0033 989.7774 1014.5319 1029.0972 1031.7446 1034.8340 1050.2950 1060.0627 1063.6527 1086.1462 1089.3875 1099.6039 1123.7608 1131.7802 1148.7911 1156.2555 1170.2787 1173.3363 1189.8036 1200.1232 1202.6327 1207.2108 1219.6443 1239.0632 1248.1866 1263.2712 1280.1422 1283.0985 1299.1545 1308.3687 1325.7029 1338.6983 1345.9516 1355.0586 1355.7445 1359.6862 1362.9255 1375.4769 1380.5161 1387.0716 1394.7317 1425.0913 1434.8014 1437.5474 1445.7718 1456.9032 1457.9956 1461.4002 1464.3945 1472.5499 1475.3347 1496.1916 1573.5287 1577.8618 1593.8880 1618.0808 2811.4515 2839.9882 2855.1217 2902.1579 2929.2664 2965.6263 2987.7973 3011.5884 3031.3946 3048.5841 3050.2925 3054.1196 3072.3033 3085.2404 3089.1911 3116.3896 3120.0001 3126.6776 3133.2183 3147.7124 3149.7596 3157.9966 3165.0047 3168.9169
redmass: 5.1726 3.8841 4.7503 4.7119 3.3879 3.6820 3.8759 4.5029 3.8902 3.1144 3.7688 2.9957 2.4300 3.8207 3.2034 3.2754 3.5283 3.2061 3.7356 2.4403 2.8871 3.1581 2.9476 3.5487 3.4321 2.8670 2.9128 2.8439 3.6072 4.2153 5.1867 6.2445 3.0793 3.1615 5.1202 1.7755 3.9844 3.4632 1.9127 1.6903 2.2971 2.4107 1.2992 1.9742 1.5723 1.7980 1.8268 1.4668 3.7391 2.4068 1.3774 1.5220 2.2183 2.0203 1.3951 5.2221 1.3323 2.4879 3.9019 2.6640 2.2329 2.0648 2.0082 1.9746 1.9665 1.7252 2.0906 1.7718 2.5901 1.6891 2.6600 1.0694 1.0677 2.1274 1.1491 1.2459 1.4291 1.7019 1.4238 1.3239 1.3044 1.3429 1.3335 1.3074 1.2117 1.3869 1.6541 1.4117 1.3429 2.0408 1.7368 1.5303 1.8450 2.1154 2.4892 1.5150 1.9829 1.0996 1.0858 2.4293 1.0897 1.1005 2.0514 1.1415 1.1178 1.1195 2.3730 6.1526 5.9235 6.3433 6.0794 1.0807 1.0715 1.0703 1.0693 1.0707 1.0642 1.0619 1.0594 1.0999 1.0938 1.0925 1.0866 1.0885 1.1061 1.0898 1.0875 1.0843 1.0886 1.0876 1.0936 1.0920 1.0941 1.1008 1.0991
irintensity: 0.3546 0.1335 0.0062 0.0734 2.0879 0.1289 0.0960 0.2662 5.7700 1.2892 1.7695 1.7452 2.0513 2.1558 1.7525 9.1801 1.9070 0.7668 0.9554 1.9541 0.9536 0.9481 5.0309 0.3400 2.2085 3.1502 2.7881 16.3364 1.4655 3.3186 0.2442 0.4401 0.5010 6.1303 2.7744 41.9496 3.9259 3.6849 76.8250 47.3150 29.3387 16.1073 1.2795 1.8652 0.6049 7.9468 3.0484 0.8443 38.5597 8.3597 0.1666 6.2108 32.4914 33.3174 7.5729 11.2656 0.1526 33.7579 18.9878 15.4613 3.8269 0.8674 1.1748 3.3495 1.0437 5.3645 13.1974 7.6781 49.0411 8.3083 30.4112 0.1590 0.2604 10.1148 0.4857 9.7831 6.8325 3.8842 170.5819 5.7939 1.2317 41.1005 5.6027 6.5390 8.1087 0.9330 12.6604 1.9796 1.1332 0.2857 38.2712 1.1126 39.8628 1.1855 21.7603 3.1207 11.5134 9.8321 12.2763 1.1279 3.5976 1.3759 41.0361 58.5713 3.4448 24.5560 143.9555 2.8561 10.6731 2.6774 187.0198 56.1236 65.8286 109.2614 72.9892 68.8051 33.6491 47.5239 40.4918 29.6908 53.5672 6.6215 47.1134 18.6299 18.5617 19.1216 7.3841 9.8232 11.0179 5.8834 16.6280 41.9852 41.0521 30.7306 5.7464
temp: 298.150 k
press: 1.00000 atm
elementType: 16 7 7 6 6 6 6 6 6 6 6 6 6 6 6 6 6 6 6 6 6 6 6 1 1 1 1 1 1 1 1 1 1 1 1 1 1 1 1 1 1 1 1 1 1 1 1
symmnumber: 1
zpe: 1037628.6 jmol-1
zpe.correction: 0.395212 hartree
zpe.thermalcorrener: 0.415401 hartree
zpe.thermalcorrenthalpy: 0.416346 hartree
zpe.thermalcorrgfe: 0.344970 hartree
zpe.sumelectzpe: -1282.375236 hartree
zpe.sumelectthermal: -1282.355046 hartree
zpe.sumelectthermalent: -1282.354102 hartree
zpe.sumelectthermalfe: -1282.425478 hartree
dipole: 2.5824 0.9099 -1.9153
dipole: 3.3414
quadrupole: -148.4433 -129.6818 -147.0118
quadrupole: -3.7505 -3.6218 -2.2157
quadrupole: -6.7310 12.0305 -5.2995 -3.7505 -3.6218 -2.2157
hfenergy: -1282.7704476 hartree
pointgroup: C01 [X(C20H24N2S1)]
dipole: -1.0187712 -0.3683814 -0.7447204 debye
polarizability: 301.6297973|-21.2561069|247.8074816|7.6743488|-0.6766465|183.9488136 unknown
InChI: InChI=1S/C20H24N2S/c1-2-7-17(8-3-1)21-12-14-22(15-13-21)19-10-6-16-23-20-11-5-4-9-18(19)20/h1-5,7-9,11,19H,6,10,12-16H2
charge 0 multiplicity 1
47 atoms
S  -2.742978 -0.816178 2.091791
N  -0.560078 -0.551756 -0.547843
N  2.286092 -0.029005 -0.228035
C  -1.921642 -0.617274 -1.164654
C  0.450965 -1.304883 -1.326326
C  -0.056852 0.824083 -0.319977
C  -2.463121 -2.084256 -1.182241
C  1.798263 -1.373438 -0.582992
C  1.258927 0.779737 0.470865
C  -2.908044 0.381334 -0.539943
C  -2.281555 -2.894557 0.120305
C  -3.329533 0.384001 0.822784
C  -3.192199 -2.471624 1.28216
C  3.66031 0.160175 0.063446
C  -3.441211 1.38432 -1.393154
C  -4.218187 1.382437 1.294198
C  -4.331804 2.37619 -0.928202
C  4.589083 -0.926603 0.043699
C  4.179355 1.46199 0.349152
C  -4.713719 2.383611 0.4310
C  5.964162 -0.712452 0.278467
C  5.552257 1.660409 0.59098
C  6.464402 0.578744 0.555459
H  -1.84679 -0.314895 -2.24355
H  0.614224 -0.836516 -2.332328
H  0.104338 -2.339791 -1.489736
H  -0.798942 1.391282 0.264772
H  0.111949 1.365859 -1.286363
H  -1.962942 -2.631832 -2.004631
H  -3.535727 -2.043523 -1.455905
H  1.679876 -2.013123 0.323366
H  2.527455 -1.859477 -1.254352
H  1.621549 1.809267 0.611319
H  1.049051 0.348547 1.475805
H  -2.494676 -3.96175 -0.100847
H  -1.229404 -2.827935 0.452108
H  -4.250944 -2.407666 0.975442
H  -3.11321 -3.185897 2.121123
H  -3.130966 1.391271 -2.445307
H  -4.529812 1.355004 2.343586
H  -4.716729 3.135046 -1.618039
H  4.243853 -1.949356 -0.131243
H  3.515448 2.331826 0.357563
H  -5.400419 3.14618 0.814506
H  6.646192 -1.570926 0.257069
H  5.913601 2.674389 0.799871
H  7.531231 0.739416 0.742132
