program: Gaussian 09
title: 000210008
version: EM64L-G09RevD.01
frameworkgroup: C1[X(C6H13O4PS2)]
method: RPBEPBE
basis: SDD
operation: Freq
keyword: #p
keyword: freq=noraman
keyword: PBEPBE/SDD
title: #p freq=noraman PBEPBE/SDD
converged: YES YES NO NO
title: Mulliken charges:
elementType: S S P O O O O C C C C C C H H H H H H H H H H H H H
charge: 0.101674 -0.236969 0.571430 -0.470382 -0.455883 -0.410665 -0.215055 -0.247789 -0.258282 -0.681929 -0.637543 -0.642249 0.243522 0.233136 0.233494 0.233513 0.232642 0.328203 0.319069 0.215128 0.234530 0.236569 0.218854 0.224905 0.243763 0.386317
chargesum: 0.00000
title: Mulliken charges with hydrogens summed into heavy atoms:
elementType: S S P O O O O C C C C C C
charge: 0.101674 -0.236969 0.571430 -0.470382 -0.455883 -0.024349 -0.215055 0.218840 0.207873 -0.034657 0.048684 0.045272 0.243522
polarizability: 1.82118030e+02 -5.42928932e+00 1.25642933e+02 9.40817642e+00 -9.79522801e+00 1.23346593e+02
1716.lowfreq: -11.3887 -2.5716 -0.0003 0.0013 0.0022 16.1765 19.7852 32.9347 34.4664
frequency: 17.7145 32.7659 34.4164 48.9073 59.6037 68.3325 80.5296 91.5802 128.8209 140.9960 154.8645 169.7474 193.9513 224.4538 238.8623 248.7973 312.9361 344.4902 365.6985 391.4916 427.6855 447.9573 498.4327 539.2472 563.2445 625.3705 630.3478 667.9057 727.9574 798.3584 798.5013 846.1422 857.8703 869.9816 901.5445 1008.2781 1017.1172 1048.0623 1090.1706 1091.8573 1137.8049 1140.6061 1145.4309 1226.9209 1270.1031 1270.4964 1319.6579 1350.2284 1354.1598 1394.3599 1395.6450 1428.0304 1459.3905 1460.8114 1462.1896 1464.4091 1476.5866 1478.1277 1666.5303 2990.4052 2990.9506 2998.6609 3004.8615 3044.8858 3077.3816 3080.4827 3085.8078 3090.2405 3107.6454 3112.3279 3115.7063 3518.0928
redmass: 5.8029 6.2023 3.8898 3.0404 4.6254 3.5851 2.8368 4.2779 4.4072 5.2473 7.6988 2.8848 4.0854 3.3837 1.5364 1.3264 5.9339 3.7159 7.9303 6.9917 3.4103 4.3584 1.7712 11.5796 4.8221 3.4390 1.7898 10.5997 6.5876 1.1214 1.1261 3.8293 3.4024 5.1956 1.7388 2.7703 3.0455 2.2050 2.1881 2.1644 1.5096 1.5436 1.1544 1.3042 1.1140 1.1111 2.1508 1.2075 1.2105 1.2261 1.2213 1.0989 1.0710 1.0663 1.0464 1.0463 1.0565 1.0551 8.7293 1.0364 1.0364 1.0627 1.0631 1.0579 1.1018 1.1009 1.0975 1.0980 1.1027 1.1030 1.1046 1.0641
irintensity: 0.2022 0.5862 1.0719 0.3195 1.1678 1.2401 2.9905 1.2129 1.5845 1.7187 4.8682 3.5711 9.0534 7.4756 2.7488 2.3670 8.0663 3.5604 17.3251 3.0105 3.1024 13.6494 32.3731 125.7651 56.7472 10.4030 217.2839 100.7189 46.6757 3.5979 4.1198 155.4966 58.0033 4.8521 10.5648 167.5251 84.7637 319.6101 8.9274 8.4258 1.6684 7.4719 0.2102 0.1896 0.1392 0.4897 69.9257 19.1151 11.6194 35.6362 26.7669 47.7094 2.5091 14.2389 8.6468 14.6981 12.9585 11.0901 173.1729 15.2986 14.6570 29.6380 30.5873 19.9895 1.7978 9.3988 32.0997 26.5941 25.9964 27.7205 0.3168 33.7963
temp: 298.150 k
press: 1.00000 atm
elementType: 16 16 15 8 8 8 8 6 6 6 6 6 6 1 1 1 1 1 1 1 1 1 1 1 1 1
symmnumber: 1
zpe: 507957.9 jmol-1
zpe.correction: 0.193471 hartree
zpe.thermalcorrener: 0.211437 hartree
zpe.thermalcorrenthalpy: 0.212381 hartree
zpe.thermalcorrgfe: 0.143840 hartree
zpe.sumelectzpe: -1673.625466 hartree
zpe.sumelectthermal: -1673.607499 hartree
zpe.sumelectthermalent: -1673.606555 hartree
zpe.sumelectthermalfe: -1673.675097 hartree
dipole: -0.3078 -1.0955 4.1858
dipole: 4.3378
quadrupole: -93.8438 -91.3244 -107.1858
quadrupole: 0.0519 2.8001 5.4303
quadrupole: 3.6075 6.1269 -9.7345 0.0519 2.8001 5.4303
hfenergy: -1673.8189366 hartree
pointgroup: C01 [X(C6H13O4P1S2)]
dipole: 0.3592377 0.4868495 1.595754 debye
dipolederiv: -0.4205388 0.0444432 -0.0231343 0.1318837 -0.1822252 0.0122745 0.1634592 0.0643751 -0.1618568 -0.6325733 0.0683141 0.2000008 0.0379424 -0.4353368 -0.0631964 0.1554625 -0.0288732 -0.5039297 1.9557394 -0.1277453 -0.2737723 0.2627129 1.5652826 0.0558794 0.0109514 -0.2477471 1.4287293 -0.9488969 -0.357185 -0.0554009 -0.5627961 -1.2501317 -0.1205411 -0.054525 -0.1390944 -0.5349724 -0.6566044 0.167036 -0.0524914 0.1248038 -1.0750891 0.3303755 -0.1902108 0.4902647 -0.8738896 -0.664887 0.2472253 0.4421086 0.2502334 -0.5127363 -0.2325567 0.5333868 -0.2632806 -0.9982881 -0.8384977 -0.1725407 -0.150995 -0.0191642 -0.4481547 -0.2523733 0.1903706 -0.207091 -0.6652731 0.6745524 0.6118342 0.1478086 0.2027844 0.5880579 0.084351 0.0606803 -0.0031876 0.3130708 0.2749054 -0.1019846 0.1436811 -0.1520248 0.8647516 -0.4220684 -0.0082916 -0.0490645 0.2606184 -0.3923592 -0.1000466 0.0012337 -0.3913442 0.084091 0.043889 -0.4410783 0.0063114 0.1347376 -0.1391259 -0.1031089 -0.1289114 -0.0094381 -0.0038205 0.001605 -0.1383715 0.0122678 -0.0852369 -0.0370544 -0.106731 -0.050491 -0.0781707 -0.1899395 0.0528249 -0.0137272 -0.0197479 0.0294618 1.4101737 0.0411115 -0.2950117 0.0647854 0.5285438 0.4937926 -0.4240449 0.5271578 1.2055403 -0.0152181 -0.0974275 0.0328588 0.0231125 0.085514 -0.0715552 0.0496922 0.0190198 -0.0912043 -0.0291173 0.0030596 -0.0371509 0.0138008 -0.1302085 0.0239822 -0.0269951 -0.0144065 0.0915049 -0.0560796 0.0230883 0.0348749 0.0015336 -0.0002687 0.049359 0.1341324 -0.0507801 0.0574467 0.0484064 0.0063926 -0.0734792 0.0221637 -0.0283174 0.03499 -0.1035011 0.0062931 -0.0879975 0.0969081 0.0108195 0.0316569 0.0541385 0.0022689 -0.0334649 0.0733352 -0.0404917 0.0626399 0.0957756 0.0086552 -0.0084462 0.0365419 0.0946893 0.0039377 0.0433418 0.0091814 -0.0161492 -0.0531828 -0.1601425 -0.0112542 -0.143831 -0.0294066 0.0029244 -0.0006897 0.00377 0.0913194 0.0474616 0.0448441 0.1046804 0.0300988 0.1128998 -0.0008817 0.0492019 -0.0220955 -0.07775 0.0896574 0.0911737 0.0055215 0.099014 -0.0833849 0.0133836 0.0030954 -0.0289163 0.0617843 0.0509045 0.0956239 -0.0260103 0.0808269 -0.1263808 0.0874572 -0.0275135 0.0689854 0.0954398 -0.0568494 -0.0184995 0.1030471 0.0360885 0.0918322 -0.0651479 0.0985454 -0.0335044 0.0179266 0.0524318 -0.0421646 -0.033921 -0.0063665 0.127162 0.0086293 -0.0619539 -0.0110516 -0.0904494 0.1440685 -0.076045 -0.0270027 -0.1093296 0.3503075 -0.0378697 -0.0747524 -0.0482942 0.3367772 unknown
polarizability: 177.5389852|0.5713909|125.6482088|-19.5405984|8.9407716|127.9203619 unknown
InChI: InChI=1S/C4H10O2PS.C2H3O2S/c1-3-5-7(8)6-4-2;3-2(4)1-5/h3-4H2,1-2H3;3H,1H2
charge 0 multiplicity 1
26 atoms
S  -1.346154 -0.479054 -1.237257
S  2.24785 -0.706805 -2.139917
P  0.848804 -0.067827 -0.760469
O  0.718499 1.625492 -0.410463
O  1.057258 -0.641493 0.880266
O  -4.014259 0.611014 1.61661
O  -4.212539 -0.592043 -0.36569
C  1.935789 2.485739 -0.536305
C  1.644168 -1.997924 1.097218
C  -2.028835 0.355632 0.324516
C  2.909487 2.291961 0.627445
C  0.606918 -3.111434 0.93242
C  -3.50653 0.049262 0.438159
H  2.416285 2.279945 -1.512307
H  1.505685 3.500562 -0.548747
H  2.498797 -2.13193 0.40569
H  2.018045 -1.937666 2.13286
H  -1.863793 1.441943 0.253088
H  -1.485964 -0.020916 1.206843
H  3.724267 3.036588 0.552358
H  2.396613 2.428901 1.59421
H  3.361684 1.285243 0.609819
H  1.064111 -4.082119 1.201331
H  -0.260419 -2.945576 1.594637
H  0.24447 -3.178909 -0.1077
H  -4.98944 0.420008 1.680885
