program: Gaussian 09
title: 000208825
version: EM64L-G09RevD.01
frameworkgroup: C1[X(C5H9NO3S)]
method: RPBEPBE
basis: SDD
operation: Freq
keyword: #p
keyword: freq=noraman
keyword: PBEPBE/SDD
title: #p freq=noraman PBEPBE/SDD
converged: NO YES NO NO
title: Mulliken charges:
elementType: S O O O N C C C C C H H H H H H H H H
charge: 0.002772 -0.253059 -0.451690 -0.211255 -0.394736 -0.594071 0.347915 -0.638943 -0.387197 0.183315 0.269024 0.350644 0.281395 0.285535 0.224655 0.265620 0.230589 0.093215 0.396271
chargesum: 0.00000
title: Mulliken charges with hydrogens summed into heavy atoms:
elementType: S O O O N C C C C C
charge: 0.095987 -0.253059 -0.055419 -0.211255 -0.044091 -0.325047 0.347915 0.081922 0.179734 0.183315
polarizability: 1.08871200e+02 -1.64435780e+00 8.43495071e+01 3.39427203e-02 -1.08943386e+00 6.57897627e+01
1716.lowfreq: -7.2841 -3.9554 -0.0023 -0.0006 -0.0003 11.9240 19.9229 44.1381 58.0583
frequency: 18.8499 44.1195 58.0353 96.0888 127.4398 136.2771 221.7744 224.7383 248.0439 274.4200 289.7375 369.5991 489.8366 517.1487 542.6750 585.0651 597.9327 649.0350 662.7881 738.7074 808.7331 821.1841 904.2321 978.8795 996.0710 1065.8102 1081.3278 1086.9525 1139.6540 1193.3633 1211.4063 1215.3696 1297.6319 1314.4086 1340.7307 1396.0333 1457.6435 1464.9728 1472.4760 1474.9385 1617.8263 1687.6563 2423.1484 2991.1067 2999.6416 3029.3778 3030.1665 3094.8689 3117.0453 3533.8754 3547.1099
redmass: 4.5310 8.7373 5.9005 3.3963 1.6446 1.9766 1.4289 2.5267 3.1765 5.9355 4.0528 5.3930 1.8370 5.9051 4.1061 1.3470 2.7045 1.4672 4.1175 5.5684 4.7437 1.1261 3.7301 2.0238 1.5934 2.1587 2.0746 2.1410 2.5191 1.5163 1.1331 1.4104 1.9705 1.5932 1.7582 1.2012 1.1201 1.0507 1.2620 1.4493 7.2929 9.2587 1.0384 1.0610 1.0361 1.0964 1.0883 1.0994 1.1008 1.0645 1.0784
irintensity: 1.2785 3.4126 3.0429 5.9084 17.9386 3.9905 1.9931 6.9731 3.6291 6.2714 6.5802 11.7121 49.8888 11.8365 47.4779 33.6880 3.7953 193.4539 5.8102 2.5828 9.9744 1.5641 50.6346 0.4708 8.0612 12.4250 190.2748 51.6807 7.4245 31.1207 1.1872 14.6566 28.1190 25.8439 8.4964 30.0435 6.9316 28.3421 111.2121 237.7572 147.9217 264.3124 36.1759 23.5788 17.3970 3.5702 20.7748 18.3009 11.0769 33.1172 63.5581
temp: 298.150 k
press: 1.00000 atm
elementType: 16 8 8 8 7 6 6 6 6 6 1 1 1 1 1 1 1 1 1
symmnumber: 1
zpe: 368963.9 jmol-1
zpe.correction: 0.140531 hartree
zpe.thermalcorrener: 0.152616 hartree
zpe.thermalcorrenthalpy: 0.153560 hartree
zpe.thermalcorrgfe: 0.100069 hartree
zpe.sumelectzpe: -873.635041 hartree
zpe.sumelectthermal: -873.622955 hartree
zpe.sumelectthermalent: -873.622011 hartree
zpe.sumelectthermalfe: -873.675503 hartree
dipole: 1.5568 -3.0576 3.3459
dipole: 4.7924
quadrupole: -75.6554 -67.5893 -66.2747
quadrupole: -6.7138 0.4244 1.8511
quadrupole: -5.8156 2.2505 3.5651 -6.7138 0.4244 1.8511
hfenergy: -873.7755716 hartree
pointgroup: C01 [X(C5H9N1O3S1)]
dipole: 0.4169738 1.2327246 -1.3643974 debye
dipolederiv: -0.0101795 0.1219744 -0.1337731 0.2082011 -0.2465271 -0.05773 -0.1026716 -0.0199333 -0.1791187 -0.6758563 0.0945098 0.004125 -0.1995719 -0.8014168 0.2172452 0.1445584 0.2912977 -0.462769 -0.4270278 0.1292293 -0.0705752 0.2150433 -0.957917 0.3559004 -0.1297956 0.3416101 -0.6452107 -1.1223316 0.2017787 -0.0906734 -0.0039236 -0.5056815 0.1263592 0.011404 0.1182759 -0.3986869 -1.1784379 -0.1458648 0.2455522 -0.236646 -0.492352 0.0597194 0.2197944 0.0452952 -0.4626635 -0.1181606 0.1301728 0.0692354 0.0525134 0.1840226 0.2107614 -0.0155127 0.1715855 0.3186972 1.4033967 -0.0062583 -0.3255594 0.2676627 0.8919379 -0.4030902 -0.3530998 -0.4972995 0.3288523 -0.0278092 -0.0222844 0.0271611 -0.0320037 -0.040779 -0.0135687 -0.0485667 -0.0540651 -0.004866 0.3183384 -0.1713982 0.0786749 -0.381322 0.0813766 0.1704887 0.2256471 0.1480194 0.1841225 1.4705974 -0.1692785 0.0612322 -0.0496402 1.1051267 -0.5909239 0.0199258 -0.5622769 0.5879187 -0.0086101 -0.0335857 0.0895521 -0.0088098 -0.0424835 0.0258783 0.041234 0.0249556 -0.1284163 0.2690848 0.0382684 -0.0385844 0.0901874 0.2056209 0.0474131 -0.0697648 0.0572787 0.2771131 -0.0149566 -0.0031847 0.0198608 0.106052 0.0057681 -0.0638141 -0.0044818 -0.0611541 0.0826254 0.001416 -0.0062525 0.0093089 0.0500832 0.112925 -0.0128848 -0.0838422 -0.0046994 -0.0106467 0.0897699 -0.001828 0.0341051 -0.0180643 0.001019 -0.123509 0.0180023 -0.1157102 -0.0353198 0.1348407 -0.0138489 -0.0098457 -0.0343014 0.0648189 0.0613565 0.0467666 0.0903968 -0.0083277 -0.0873179 0.0694287 -0.0498405 0.1156095 0.0397757 0.029435 -0.0285098 0.0230267 0.1071061 -0.1126282 -0.1532822 0.0356405 -0.1171597 0.0390986 -0.0693969 0.0949092 -0.0281003 0.0580909 0.0958718 -0.058296 0.0444037 -0.02391 0.3556667 0.0303604 0.0140031 0.0314973 0.3914994 unknown
polarizability: 107.7919333|1.1571934|84.3528982|-6.8781629|-0.718294|66.8656379 unknown
InChI: InChI=1S/C5H9NO3S/c1-3(10)5(9)6-2-4(7)8/h3,6-7,10H,2H2,1H3
charge 0 multiplicity 1
19 atoms
S  -2.725698 1.417532 1.119721
O  -1.022704 -1.677447 0.802964
O  2.271724 1.283168 -1.175086
O  3.848647 -0.170787 -0.271602
N  0.177354 -0.040172 -0.312946
C  -2.275022 0.167289 -0.270937
C  -1.008558 -0.607445 0.124676
C  -3.482101 -0.764491 -0.43985
C  1.45864 -0.649977 0.041767
C  2.656112 0.135667 -0.457967
H  -2.103368 0.764292 -1.184324
H  0.19656 0.801273 -0.89309
H  1.534745 -1.680563 -0.358442
H  1.548934 -0.761427 1.139823
H  -3.314173 -1.450951 -1.289033
H  -3.613146 -1.376802 0.467225
H  -4.402305 -0.186707 -0.631067
H  -1.546067 2.146191 1.06445
H  3.079027 1.772055 -1.48828
