program: Gaussian 09
title: 000210227
version: EM64L-G09RevD.01
frameworkgroup: C1[X(C21H33N2S)]
method: RPBEPBE
basis: SDD
operation: Freq
keyword: #p
keyword: freq=noraman
keyword: PBEPBE/SDD
title: #p freq=noraman PBEPBE/SDD
converged: YES YES NO NO
title: Mulliken charges:
elementType: S N N C C C C C C C C C C C C C C C C C C C C C H H H H H H H H H H H H H H H H H H H H H H H H H H H H H H H H H
charge: 0.315838 -0.176482 -0.139516 -0.417888 -0.367849 -0.391551 -0.506248 -0.377093 -0.243557 -0.344844 0.455776 -0.204429 -0.354741 0.463838 -0.773571 -0.642315 -0.688336 -0.320469 -0.362363 0.420597 -0.365904 -0.340063 -0.639079 -0.639276 0.223280 0.205560 0.215342 0.219078 0.198728 0.214177 0.221898 0.257006 0.202641 0.179784 0.195522 0.184978 0.185972 0.199028 0.260891 0.259866 0.257117 0.268768 0.285231 0.261805 0.208791 0.220986 0.215359 0.246942 0.244592 0.259103 0.260496 0.251305 0.252691 0.239862 0.251062 0.250756 0.240906
chargesum: 1.00000
title: Mulliken charges with hydrogens summed into heavy atoms:
elementType: S N N C C C C C C C C C C C C C C C C C C C C C
charge: 0.315838 -0.176482 -0.139516 0.010952 0.066571 0.021354 -0.027344 0.005332 -0.243557 0.035657 0.455776 -0.204429 0.030259 0.463838 0.004304 0.173490 -0.043201 -0.073527 -0.117771 0.420597 -0.106801 -0.079567 0.104779 0.103448
polarizability: 4.60474369e+02 -8.48637075e+01 3.05843791e+02 -1.12319901e+01 6.44825743e+00 1.66516912e+02
1716.lowfreq: -34.5573 -8.1923 -5.0519 -0.0007 0.0006 0.0010 0.9766 4.7925 11.8955
frequency: -33.5546 3.7405 11.5651 28.5021 29.6335 45.9059 64.3228 67.6838 77.7006 80.9184 109.8663 120.1352 125.6364 138.6130 153.2102 170.1692 178.0663 178.9412 184.6543 207.8449 213.8546 215.2088 229.9158 243.1489 260.1384 285.5921 295.4994 311.7838 342.3351 353.1454 366.9453 395.0310 403.5663 419.9469 427.5443 469.7339 479.4701 495.0715 517.4366 521.9165 554.1896 562.8211 601.4201 627.5404 632.6176 661.0678 709.4936 722.9334 731.5347 735.8648 753.3846 798.6494 807.0070 830.0023 845.0174 855.8231 866.5925 900.0247 927.3665 935.9498 947.8100 959.4057 965.3533 967.3257 983.6763 997.0004 1008.3881 1035.6784 1042.6012 1051.5675 1052.0472 1064.9084 1081.4932 1095.1152 1104.6313 1109.6305 1114.9337 1115.2850 1116.5174 1123.2701 1147.8582 1166.6048 1170.8796 1195.1612 1204.7914 1223.6693 1233.7698 1241.2152 1246.5060 1265.7851 1272.2122 1285.5385 1287.9513 1291.3862 1297.7313 1308.3404 1312.6170 1329.2911 1338.7591 1350.9564 1351.3117 1359.7541 1368.8376 1384.0543 1392.6377 1409.1158 1427.9614 1433.0540 1450.2031 1452.9524 1460.6385 1462.1496 1464.2767 1465.4512 1468.7719 1468.9756 1469.4155 1472.8029 1474.1672 1476.0484 1476.5885 1481.4161 1484.5996 1487.0640 1487.6273 1490.1354 1494.4755 1507.5162 1524.8940 1550.1877 1617.4114 1634.0495 2945.6955 2954.4319 2959.5205 2965.8229 2970.4651 2971.5516 2975.5967 2976.9852 2980.7137 2987.1781 2988.9003 2990.0115 3001.1565 3015.0269 3017.8582 3026.9952 3032.4550 3038.5703 3049.5748 3052.8117 3055.3773 3069.3262 3070.8000 3076.3075 3115.2185 3119.6442 3121.4312 3131.8182 3133.6472 3140.5365 3155.0237 3181.0058 3184.1615
redmass: 1.6177 3.8342 4.0241 3.6652 3.9524 3.2354 3.6533 3.7413 2.8098 2.1094 2.3894 2.0294 2.8956 1.2154 3.0492 2.8784 1.4440 1.3453 1.9548 2.1592 1.2849 1.4505 3.2388 2.2389 3.2597 2.5121 3.1130 2.5055 3.0924 2.9439 3.0607 5.0266 2.8328 3.3363 3.0986 4.2987 3.7950 2.6408 3.4224 5.7482 3.5431 4.4926 4.9858 5.4225 5.9335 3.6911 1.1495 1.1144 3.7335 3.9516 1.3155 1.5672 1.2595 1.8197 2.1105 2.1395 1.9662 1.8869 4.1946 3.0399 1.7560 1.3434 1.8399 1.3857 2.9573 2.3001 1.6159 3.0412 1.4640 1.7022 2.0360 2.1439 2.1766 1.2345 2.3087 2.0110 1.6189 1.3488 1.3727 2.4139 1.6425 1.6490 1.3865 1.5844 2.4801 1.2276 1.3440 2.5583 1.3132 1.2658 1.3307 1.2151 1.0623 2.8348 1.1536 1.9887 1.9554 1.5010 1.4403 1.5658 1.4211 1.4869 3.7359 2.4391 1.2137 1.2663 1.5896 1.1500 1.0887 1.2218 1.0736 1.0912 1.0858 1.0806 1.1179 1.0569 1.7400 1.0736 1.2618 1.1488 1.0423 1.0790 1.0444 1.1864 1.1085 1.2036 1.3246 1.4085 5.0267 3.4935 7.2212 6.1521 1.0596 1.0600 1.0639 1.0616 1.0623 1.0368 1.0363 1.0387 1.0624 1.0847 1.0679 1.0413 1.0983 1.0358 1.0989 1.0989 1.1012 1.1029 1.1006 1.1031 1.1023 1.0978 1.1005 1.0993 1.1002 1.0959 1.0981 1.0959 1.0904 1.1021 1.0884 1.0940 1.0948
irintensity: 0.0637 0.2295 0.5073 0.3479 0.6443 1.4449 0.1890 0.4959 0.4321 1.0273 0.0588 0.0399 1.5450 3.1810 0.3285 0.7606 0.4286 0.7675 0.3500 0.1430 0.5253 0.8505 2.3073 2.0264 7.5417 0.2760 0.4519 1.2387 0.2220 0.0937 4.3998 2.2371 1.3745 0.5499 8.0143 2.9381 5.4398 1.8993 10.6896 5.4211 6.0366 4.4404 3.8919 3.4522 4.3350 4.7094 19.4355 4.9197 0.4237 22.9768 7.2944 15.1829 7.8819 68.1047 12.0015 4.6161 0.3261 4.0029 36.3109 2.6705 2.8256 0.9902 2.2710 0.9648 0.3961 3.3456 4.0988 0.5045 2.2153 17.6870 6.9602 5.2826 3.2388 0.8023 15.0059 10.7832 3.4398 0.9172 0.6359 2.1329 2.9336 6.8555 2.8545 2.7340 52.8367 102.4888 6.4446 17.7998 2.7567 1.3244 9.6426 1.6878 0.5088 25.2872 7.8865 21.6142 12.8800 16.7003 3.8062 1.1401 7.5061 5.9742 12.2630 109.3858 12.7540 60.6909 321.7737 10.9343 14.4197 55.9405 1.1519 4.8624 7.6325 4.6447 14.9615 1.1027 22.6247 1.8045 15.8082 67.7121 12.9087 3.8532 33.0895 23.7618 12.0558 6.1766 19.2014 384.2037 19.4313 0.6352 352.8801 488.8036 19.3753 2.1613 13.7068 98.4528 32.7451 50.8236 38.3341 86.6389 8.0024 26.6439 11.8316 13.9706 1.1982 12.8808 22.8535 6.1268 23.1991 154.2789 4.9687 39.9752 44.9978 6.6640 85.4075 42.9579 6.1621 7.0159 2.4393 25.4156 1.3562 1.9508 3.1280 7.2892 4.2795
temp: 298.150 k
press: 1.00000 atm
elementType: 16 7 7 6 6 6 6 6 6 6 6 6 6 6 6 6 6 6 6 6 6 6 6 6 1 1 1 1 1 1 1 1 1 1 1 1 1 1 1 1 1 1 1 1 1 1 1 1 1 1 1 1 1 1 1 1 1
symmnumber: 1
zpe: 1302706.5 jmol-1
zpe.correction: 0.496175 hartree
zpe.thermalcorrener: 0.523286 hartree
zpe.thermalcorrenthalpy: 0.524230 hartree
zpe.thermalcorrgfe: 0.434184 hartree
zpe.sumelectzpe: -1325.535036 hartree
zpe.sumelectthermal: -1325.507924 hartree
zpe.sumelectthermalent: -1325.506980 hartree
zpe.sumelectthermalfe: -1325.597026 hartree
dipole: -10.0908 -3.9131 -0.9437
dipole: 10.8640
quadrupole: -46.4745 -105.7500 -152.2200
quadrupole: -20.1022 -0.7322 5.2109
quadrupole: 55.0070 -4.2685 -50.7385 -20.1022 -0.7322 5.2109
hfenergy: -1326.0312102 hartree
pointgroup: C01 [X(C21H33N2S1)]
dipole: -3.8514299 -1.8535108 -0.0031756 debye
polarizability: 471.2644556|-74.0653179|293.8900455|-13.8887308|-7.3711479|167.6805703 unknown
InChI: InChI=1S/C21H33N2S/c1-6-7-8-9-10-11-12-20-17(2)23(5)21(24-20)18-13-15-19(16-14-18)22(3)4/h13-16H,6-12H2,1-5H3
charge 1 multiplicity 1
57 atoms
S  0.361029 -0.101509 0.240771
N  -0.824113 -2.385334 -0.153417
N  -6.210603 1.555579 0.354928
C  4.935858 -0.850778 1.555632
C  3.390668 -0.841562 1.454244
C  5.683871 -0.089417 0.432214
C  2.870843 -1.48361 0.134754
C  5.326972 1.411416 0.324472
C  1.375736 -1.603769 0.064155
C  6.196962 2.163872 -0.70819
C  0.569324 -2.708416 -0.115223
C  -1.140689 -1.061709 0.03222
C  5.836973 3.661608 -0.837607
C  -2.444236 -0.443634 0.090125
C  1.015748 -4.135558 -0.281635
C  -1.831646 -3.416524 -0.503883
C  6.717821 4.40459 -1.864987
C  -3.598531 -1.092533 0.642177
C  -2.605443 0.913874 -0.344175
C  -4.993862 0.912514 0.274301
C  -4.828501 -0.441538 0.736018
C  -3.831689 1.570535 -0.266493
C  -6.347384 2.958608 -0.088384
C  -7.391149 0.85831 0.904749
H  5.215544 -0.409604 2.532922
H  5.287657 -1.9026 1.578875
H  3.016141 0.198604 1.529125
H  2.965127 -1.393391 2.314737
H  5.511337 -0.58005 -0.548628
H  6.771969 -0.181972 0.620921
H  3.31687 -2.489464 0.02138
H  3.233808 -0.888671 -0.726316
H  5.446122 1.888335 1.31984
H  4.258013 1.534434 0.047958
H  7.265165 2.069105 -0.423364
H  6.097951 1.676505 -1.701167
H  4.769475 3.758095 -1.125504
H  5.936227 4.147002 0.1547
H  2.085662 -4.22617 -0.042515
H  0.881087 -4.496967 -1.318271
H  0.467504 -4.817579 0.392321
H  -1.39021 -4.122612 -1.221885
H  -2.699704 -2.931658 -0.973183
H  -2.159537 -3.973326 0.390192
H  6.615601 3.960267 -2.873033
H  6.441823 5.472217 -1.937326
H  7.786007 4.351933 -1.583041
H  -3.517981 -2.098541 1.06493
H  -1.752064 1.445822 -0.781396
H  -5.666308 -0.972166 1.194096
H  -3.901014 2.596375 -0.635052
H  -6.124508 3.065357 -1.166945
H  -5.675797 3.628899 0.480339
H  -7.38093 3.293686 0.079002
H  -7.243711 0.586889 1.96764
H  -7.618106 -0.060629 0.332425
H  -8.266881 1.519867 0.842054
