program: Gaussian 09
title: 000208439
version: EM64L-G09RevD.01
frameworkgroup: C1[X(C22H29N3O4)]
method: RPBEPBE
basis: SDD
operation: Freq
keyword: #p
keyword: freq=noraman
keyword: PBEPBE/SDD
title: #p freq=noraman PBEPBE/SDD
converged: YES YES NO NO
title: Mulliken charges:
elementType: O O O O N N N C C C C C C C C C C C C C C C C C C C C C C H H H H H H H H H H H H H H H H H H H H H H H H H H H H H
charge: -0.445664 -0.312305 -0.270891 -0.259990 -0.103190 -0.174520 -0.449025 -0.372291 -0.364601 -0.406183 -0.384614 -0.372199 -0.140168 0.470097 -0.317320 -0.351306 -0.388302 -0.376300 -0.358639 0.318028 0.391342 -0.396121 -0.318325 -0.324055 -0.455872 0.481241 -0.537399 0.216209 -0.781367 0.204318 0.195830 0.190953 0.215889 0.198387 0.219378 0.206016 0.209630 0.220266 0.218167 0.220455 0.234914 0.228811 0.238310 0.218181 0.352902 0.243755 0.235213 0.247527 0.252005 0.312469 0.217275 0.217194 0.241624 0.216157 0.300416 0.211167 0.257920 0.258599
chargesum: 0.00000
title: Mulliken charges with hydrogens summed into heavy atoms:
elementType: O O O O N N N C C C C C C C C C C C C C C C C C C C C C C
charge: -0.092762 -0.312305 -0.270891 -0.259990 -0.103190 -0.174520 -0.148609 0.027857 0.042240 0.011582 0.031032 0.066234 0.080287 0.470097 0.146405 -0.112995 -0.170121 -0.132545 -0.123426 0.318028 0.391342 -0.148594 -0.066320 -0.011586 -0.238596 0.481241 0.137576 0.216209 -0.053682
polarizability: 3.64488287e+02 5.78951280e+00 2.79965859e+02 2.94041880e+01 4.96302705e+00 2.30059071e+02
1716.lowfreq: -10.8493 -0.4060 -0.0012 -0.0002 0.0011 3.6389 7.0871 16.7207 22.9479
frequency: 6.4686 16.5514 22.9099 27.7237 38.3466 54.1899 55.8966 59.1559 67.2498 75.7123 85.8860 95.0267 114.8018 125.7391 152.3564 163.4169 175.3819 194.4040 204.4518 218.2818 229.5441 248.0843 263.3464 292.1312 309.1505 332.7279 338.9568 353.0345 367.6478 374.4184 391.0115 412.2835 413.9289 421.6924 424.7872 431.4273 448.8812 469.0945 476.8035 493.6428 520.4745 527.3001 531.1815 565.7119 594.3631 604.1634 633.2147 634.1286 635.9805 658.5237 678.5603 716.1416 718.7674 771.9053 777.8246 786.9594 797.8694 804.7317 814.1599 837.0790 842.7770 848.1400 852.3123 907.7031 915.5756 921.0012 925.5364 933.4792 937.8401 943.5442 951.2442 986.0477 987.7306 992.7074 996.7822 1001.3695 1002.4783 1011.0661 1039.3714 1051.5872 1060.5453 1072.0051 1095.0913 1107.2556 1113.5001 1118.9003 1121.9236 1141.3734 1144.6829 1158.4561 1171.8738 1179.5290 1182.3312 1202.5749 1211.4557 1218.4353 1223.6459 1227.7051 1232.7750 1240.9364 1251.4158 1269.3561 1292.4739 1298.2267 1303.4017 1309.8269 1326.3529 1341.9023 1343.8641 1350.5055 1352.1614 1366.3991 1370.8580 1375.6383 1379.2115 1383.6246 1389.2792 1393.5539 1421.6990 1427.0373 1438.3625 1449.0257 1453.6193 1455.8364 1457.5637 1462.3857 1465.6864 1467.7185 1469.4530 1474.6252 1475.7545 1496.2180 1506.7936 1508.3850 1574.2579 1592.1866 1622.3909 1629.5288 1632.3632 2865.0433 2873.0075 2889.6661 2907.6184 2920.5625 2950.2540 2977.1648 2994.0233 3033.8707 3033.9919 3035.5621 3040.9732 3049.1825 3049.2677 3053.0231 3084.5336 3094.8967 3098.1276 3113.6491 3118.2604 3137.2543 3146.9077 3158.0690 3160.8931 3169.1744 3169.6568 3195.1530 3531.9061 3535.4089
redmass: 6.2433 4.8088 3.3291 4.3847 5.0463 4.3831 3.0782 1.3000 4.6153 3.3279 4.4264 3.9376 4.3066 4.6706 4.2182 3.9627 4.8168 5.0330 3.8484 2.6080 2.7170 1.4563 2.1265 2.4210 4.0744 4.4254 3.0987 4.2371 3.3186 4.8239 2.6551 3.1034 3.0300 3.2482 2.5046 2.0405 1.7021 3.5542 2.6750 4.4817 2.4089 2.4587 4.7570 3.9021 3.2913 2.7716 6.6087 6.1073 1.1793 4.7462 2.9798 3.6553 3.6992 4.3380 3.8523 3.6013 1.4843 1.3983 1.6658 4.7158 2.7401 1.6961 1.4907 2.2175 1.5442 2.0954 1.8555 6.3760 1.4095 2.3062 3.1263 4.7482 1.3087 1.8034 2.6746 2.6211 2.1657 2.3867 1.6244 1.8005 2.1617 2.1802 2.2526 2.0522 1.2602 1.4124 1.3050 2.5839 2.4444 1.3558 1.9577 1.2666 1.3089 1.0915 2.3220 3.0428 1.5782 1.9381 1.7699 1.5859 1.3173 2.1065 1.4357 1.4146 1.4236 1.3275 1.4017 1.2965 1.5777 1.4447 1.9063 1.7428 3.3088 2.1736 1.5440 1.4335 1.2152 1.4165 4.0794 3.3710 1.2036 1.0452 1.0819 1.1124 1.0881 1.0934 1.0503 1.1026 1.0959 1.0737 1.1006 2.1128 2.4549 2.5916 7.0661 6.7545 4.6718 6.4438 6.4546 1.0712 1.0697 1.0692 1.0709 1.0683 1.0334 1.0550 1.0363 1.0877 1.1035 1.0890 1.0906 1.0898 1.1047 1.0938 1.0889 1.1001 1.0982 1.0900 1.0986 1.0866 1.0869 1.0906 1.0949 1.0961 1.0933 1.0954 1.0653 1.0765
irintensity: 0.0612 2.6541 1.5810 3.2287 0.3521 1.2583 1.7754 0.7273 6.1795 3.4406 0.2987 1.7161 1.2409 3.2621 5.8544 1.6213 6.3811 0.2394 7.7267 5.9969 2.3393 3.0872 0.5556 11.3503 3.5753 0.5642 0.5527 4.3441 0.4672 3.9312 3.6576 3.5645 0.0551 11.7989 63.2504 13.6141 122.6623 8.8225 3.2157 22.2712 32.9907 22.0031 1.5446 9.1433 0.0120 2.1011 0.1512 0.2567 56.6918 1.0958 30.7282 1.7986 0.2762 12.4033 2.2992 25.4187 1.7296 43.1669 75.5790 0.8137 14.0086 3.0481 72.6591 43.6765 7.9591 25.3464 12.0660 5.5759 2.2466 22.1393 62.5290 17.6679 3.7059 6.2204 48.8034 90.7875 17.0621 63.5921 14.5636 13.9163 5.4501 31.9961 17.1020 11.9133 0.2363 8.6825 22.4821 65.8004 28.1245 0.1479 48.2265 86.6074 56.7344 0.2181 198.9464 208.6813 20.0107 293.5247 23.4440 55.5714 6.2170 6.3046 28.5155 21.5554 11.4452 1.6026 15.1569 4.7056 8.6067 8.9473 4.0292 9.5485 162.1865 7.0308 31.2203 32.2640 52.4101 14.3563 7.0873 5.5270 23.2694 15.1337 2.3363 127.8922 7.4925 47.3563 12.6430 29.4967 23.3927 67.1523 17.8727 12.7947 528.0715 359.5851 0.4575 60.5041 150.6847 8.3965 5.7384 59.6027 59.8080 85.3422 112.8854 112.4267 81.5880 24.5995 15.5858 14.7448 56.0023 24.7843 47.8558 26.1020 24.0586 68.5003 20.4677 19.5642 9.1028 22.5911 32.6218 19.9765 14.7909 5.0365 22.1007 4.6777 10.5809 8.6573 19.5481 10.9699
temp: 298.150 k
press: 1.00000 atm
elementType: 8 8 8 8 7 7 7 6 6 6 6 6 6 6 6 6 6 6 6 6 6 6 6 6 6 6 6 6 6 1 1 1 1 1 1 1 1 1 1 1 1 1 1 1 1 1 1 1 1 1 1 1 1 1 1 1 1 1
symmnumber: 1
zpe: 1257842.9 jmol-1
zpe.correction: 0.479087 hartree
zpe.thermalcorrener: 0.507852 hartree
zpe.thermalcorrenthalpy: 0.508797 hartree
zpe.thermalcorrgfe: 0.414772 hartree
zpe.sumelectzpe: -1318.673414 hartree
zpe.sumelectthermal: -1318.644649 hartree
zpe.sumelectthermalent: -1318.643705 hartree
zpe.sumelectthermalfe: -1318.737730 hartree
dipole: 0.4692 -3.3308 2.3864
dipole: 4.1242
quadrupole: -187.2573 -171.1891 -163.5887
quadrupole: 9.2415 -33.4929 -2.9113
quadrupole: -13.2456 2.8226 10.4230 9.2415 -33.4929 -2.9113
hfenergy: -1319.1525015 hartree
pointgroup: C01 [X(C22H29N3O4)]
dipole: -0.3846871 1.2436826 0.968543 debye
polarizability: 356.4615284|20.8337852|285.3190064|-33.6278678|-10.9376443|232.7326818 unknown
InChI: InChI=1S/C22H29N3O4/c1-17(26)23-18-3-7-22(8-4-18)29-16-20(27)15-24-11-13-25(14-12-24)19-5-9-21(28-2)10-6-19/h3-10,20,23,27H,11-16H2,1-2H3
charge 0 multiplicity 1
58 atoms
O  2.743576 -4.225786 -0.212205
O  3.135535 -1.471764 -0.290247
O  -8.371114 0.859505 0.971549
O  7.063004 3.659379 -1.683298
N  -0.499794 -2.271399 -0.406132
N  -3.226067 -1.331719 -0.134286
N  5.972899 3.388751 0.380223
C  -1.54994 -3.129264 0.192505
C  -1.101561 -1.385704 -1.432819
C  -2.65597 -2.277526 0.842483
C  -2.187639 -0.504497 -0.795057
C  0.676541 -3.033353 -0.889217
C  1.692006 -3.308278 0.24823
C  -4.49775 -0.748181 0.140162
C  2.302624 -2.016376 0.803304
C  -5.181089 -0.968406 1.375404
C  -5.15944 0.048909 -0.8363
C  -6.459864 -0.430019 1.609078
C  -6.434291 0.605131 -0.601045
C  -7.096292 0.363727 0.627747
C  3.81937 -0.264253 -0.063087
C  4.611009 0.211355 -1.135649
C  3.752497 0.474305 1.142909
C  5.333858 1.411885 -1.021761
C  4.477151 1.67855 1.257758
C  5.270772 2.161026 0.186675
C  -9.058287 1.676894 -0.026337
C  6.803854 4.067988 -0.511789
C  7.391918 5.369778 0.031708
H  -1.098262 -3.777348 0.965701
H  -2.014398 -3.792249 -0.580382
H  -1.554697 -1.97246 -2.270746
H  -0.310082 -0.7375 -1.851406
H  -2.233294 -1.747822 1.73024
H  -3.452329 -2.957061 1.193651
H  -2.648316 0.12181 -1.574896
H  -1.704903 0.174671 -0.053569
H  0.398531 -4.012751 -1.342596
H  1.187041 -2.439505 -1.669968
H  1.194425 -3.843908 1.076611
H  1.496262 -1.305109 1.066669
H  2.94347 -2.231592 1.680527
H  -4.712125 -1.54963 2.174487
H  -4.691446 0.219925 -1.811281
H  3.374587 -3.689767 -0.761009
H  -6.976203 -0.604248 2.558465
H  -6.901135 1.206646 -1.387295
H  4.651762 -0.372895 -2.060317
H  3.148146 0.130486 1.986605
H  5.945324 1.78208 -1.846188
H  4.419254 2.245759 2.195939
H  -9.25026 1.106173 -0.956883
H  -10.01555 1.957124 0.438167
H  -8.481848 2.591972 -0.269424
H  5.844031 3.824063 1.295981
H  7.09684 5.600167 1.070527
H  7.077354 6.203581 -0.619566
H  8.492801 5.313533 -0.020651
