program: Gaussian 09
title: 000206689
version: EM64L-G09RevD.01
frameworkgroup: C1[X(C14H19N3)]
method: RPBEPBE
basis: SDD
operation: Freq
keyword: #pfreq=noraman
keyword: PBEPBE/SDD
title: #p freq=noraman PBEPBE/SDD
converged: YES YES NO NO
title: Mulliken charges:
elementType: N N N C C C C C C C C C C C C C C H H H H H H H H H H H H H H H H H H H
charge: -0.184062 -0.192937 -0.103516 0.364781 0.011855 -0.538424 0.114253 -0.776340 0.474458 -0.775362 -0.635786 -0.630945 -0.368783 -0.435960 -0.220036 -0.218045 -0.243960 0.213922 0.258797 0.252876 0.224590 0.245856 0.237549 0.221481 0.236570 0.186202 0.235282 0.220623 0.238445 0.199659 0.213541 0.263455 0.227804 0.227353 0.226062 0.228745
chargesum: 0.00000
title: Mulliken charges with hydrogens summed into heavy atoms:
elementType: N N N C C C C C C C C C C C C C C
charge: -0.184062 -0.192937 -0.103516 0.364781 0.011855 -0.065705 0.114253 -0.053018 0.474458 -0.079762 0.006320 0.020699 -0.105329 -0.208156 0.007316 0.008017 -0.015215
polarizability: 2.10033197e+02 1.85146169e+01 1.46529664e+02 5.89047820e+00 7.19265700e+00 1.43733000e+02
1716.lowfreq: -20.6080 -7.4605 -5.6684 -0.0009 0.0006 0.0007 4.0510 21.9249 35.3569
frequency: -18.7877 21.7414 35.3090 41.0904 46.9668 95.0298 122.9670 133.4516 168.9661 180.8990 189.2627 207.0187 208.7113 240.1681 268.6866 286.5505 312.2963 323.7693 356.6666 403.6688 432.5705 459.1681 535.6778 552.5930 575.9049 604.1131 617.8702 631.9193 700.5217 711.7923 714.2985 752.7469 802.0790 840.8061 857.9369 905.7851 944.6261 951.5386 980.6466 989.7265 995.4877 1000.6232 1014.2913 1026.7232 1040.3943 1044.2852 1051.3860 1080.3221 1088.0829 1096.8791 1131.1971 1137.8438 1171.8936 1187.5558 1195.9993 1213.2309 1224.6789 1283.8943 1310.9824 1329.2027 1343.9053 1365.3671 1387.6089 1391.7117 1402.1155 1421.5428 1433.3850 1442.5678 1444.9607 1452.9578 1456.2731 1460.9813 1464.3325 1470.3348 1473.9067 1479.4873 1484.9163 1488.0886 1489.0037 1506.3257 1569.5552 1595.6536 1614.6473 2871.3262 2880.5854 2971.2550 2972.1347 2987.5393 2995.0189 3005.0622 3039.6329 3050.8733 3059.7150 3082.0071 3085.5299 3097.9141 3111.6929 3112.5849 3124.4500 3135.4600 3146.5164 3162.8715
redmass: 1.6626 3.3065 4.2146 1.9624 2.2264 3.1281 1.0793 1.9108 3.0369 1.6498 1.7233 1.4222 3.4493 2.9204 2.4792 4.0532 2.3425 3.5832 2.7029 2.8238 4.4329 3.0364 3.9314 3.6910 4.4944 5.0293 5.7468 5.3687 3.3404 5.0051 2.0543 2.0790 3.8197 3.1439 1.2526 1.5164 1.9863 2.4307 1.3810 6.2226 1.7994 1.4793 2.0107 2.2138 1.4458 1.4674 1.4936 1.7400 1.2421 2.1538 1.3817 2.4091 1.0551 1.1155 2.9109 2.7406 4.5935 1.7645 1.5368 3.3160 1.6751 3.1070 4.7238 1.2495 1.2633 1.1306 1.3303 2.0680 1.5064 1.1074 1.1507 1.1220 1.1244 1.1366 1.2914 1.4592 2.0061 1.4900 1.2462 1.6042 4.8208 6.1189 5.9983 1.0541 1.0561 1.0400 1.0401 1.0791 1.0620 1.0783 1.0978 1.0934 1.0992 1.0966 1.0971 1.0992 1.0938 1.0881 1.0862 1.0914 1.0962 1.1015
irintensity: 0.7214 0.0237 0.3782 1.0673 0.2333 0.6511 0.2173 3.0175 4.7858 3.0064 1.2826 0.1538 1.0706 4.6473 5.2156 2.8708 0.7178 0.2762 3.8464 0.2412 1.3689 6.6751 2.3067 9.0894 3.9823 1.6668 0.3708 0.9113 1.1494 5.1135 97.1103 24.3421 3.4058 6.1842 0.2268 3.3923 5.6382 15.0936 0.0726 0.1701 0.5312 0.1890 3.0538 8.8811 3.1056 2.2394 14.0422 12.4904 11.0808 31.4708 8.2040 21.7485 0.1333 2.7002 16.8685 9.7013 16.2664 7.9483 25.2649 39.6359 39.7172 32.8253 0.3181 20.3625 3.6084 6.3747 2.5778 10.0759 15.2834 16.7663 15.8017 11.3249 36.9091 13.1073 24.5928 8.5178 10.0748 7.7606 26.3619 13.4846 53.1168 1.1170 5.9115 75.5085 199.8111 68.4630 12.8449 74.6473 35.7132 48.7983 16.5804 21.9816 3.8846 16.9317 44.6693 11.3452 19.1699 7.9487 0.1238 13.3084 33.4533 25.8234
temp: 298.150 k
press: 1.00000 atm
elementType: 7 7 7 6 6 6 6 6 6 6 6 6 6 6 6 6 6 1 1 1 1 1 1 1 1 1 1 1 1 1 1 1 1 1 1 1
symmnumber: 1
zpe: 791702.3 jmol-1
zpe.correction: 0.301543 hartree
zpe.thermalcorrener: 0.318680 hartree
zpe.thermalcorrenthalpy: 0.319624 hartree
zpe.thermalcorrgfe: 0.255065 hartree
zpe.sumelectzpe: -707.848042 hartree
zpe.sumelectthermal: -707.830905 hartree
zpe.sumelectthermalent: -707.829961 hartree
zpe.sumelectthermalfe: -707.894520 hartree
dipole: -0.3575 -2.8023 -0.4892
dipole: 2.8670
quadrupole: -92.4343 -104.3357 -96.4638
quadrupole: 0.7494 0.7707 2.4388
quadrupole: 5.3103 -6.5911 1.2808 0.7494 0.7707 2.4388
hfenergy: -708.1495852 hartree
pointgroup: C01 [X(C14H19N3)]
dipole: 0.0296511 1.0865751 0.3013272 debye
polarizability: 205.6329218|24.5734954|155.8543584|4.3088152|-2.6796384|138.8085801 unknown
InChI: InChI=1S/C14H19N3/c1-11-14(16(3)4)12(2)17(15-11)10-13-8-6-5-7-9-13/h5-9H,10H2,1-4H3
charge 0 multiplicity 1
36 atoms
N  -0.21663 -0.243621 -1.099545
N  -3.312824 0.271565 0.739748
N  -0.767095 -1.525437 -1.210793
C  -1.03899 0.637717 -0.4055
C  -2.176948 -0.117943 -0.024634
C  1.125875 -0.008376 -1.639388
C  -1.961178 -1.442526 -0.550587
C  -0.664989 2.077169 -0.187266
C  2.206905 0.138231 -0.568552
C  -2.868204 -2.633311 -0.432597
C  -3.140647 1.131327 1.916896
C  -4.594249 0.431568 0.035197
C  2.265958 -0.768133 0.520777
C  3.183454 1.15813 -0.669756
C  3.286806 -0.653238 1.489461
C  4.209858 1.271522 0.296737
C  4.263633 0.365412 1.379892
H  1.11737 0.887079 -2.289802
H  1.333119 -0.884791 -2.279015
H  0.19166 2.188487 0.505219
H  -0.381901 2.568687 -1.137904
H  -1.516954 2.634016 0.230965
H  -3.351795 -2.643419 0.560882
H  -3.674854 -2.618256 -1.191657
H  -2.296991 -3.566522 -0.570714
H  -3.199376 2.2251 1.697245
H  -2.163167 0.926435 2.384876
H  -3.931307 0.907223 2.660824
H  -4.702803 -0.353485 -0.731724
H  -4.694366 1.421433 -0.473377
H  -5.433251 0.331486 0.75072
H  1.507687 -1.555714 0.602847
H  3.142487 1.867829 -1.506155
H  3.324067 -1.358328 2.327696
H  4.960305 2.06517 0.207028
H  5.056032 0.452015 2.131857
