program: Gaussian 09
title: 000214840
version: EM64L-G09RevD.01
frameworkgroup: C1[X(C18H19N3O6S2)]
method: RPBEPBE
basis: SDD
operation: Freq
keyword: #p
keyword: freq=noraman
keyword: PBEPBE/SDD
title: #p freq=noraman PBEPBE/SDD
converged: YES YES NO NO
title: Mulliken charges:
elementType: S S O O O O O O N N N C C C C C C C C C C C C C C C C C C H H H H H H H H H H H H H H H H H H H
charge: 0.144109 0.278316 -0.197102 -0.259443 -0.446363 -0.315707 -0.231202 -0.261742 -0.147911 -0.358027 -0.046548 -0.500596 -0.189592 0.163280 0.161871 0.316058 -0.816403 -0.463791 0.087746 0.298368 -0.815081 0.309467 -0.136838 -0.754758 -0.192848 -0.179483 -0.173451 -0.129863 -0.619968 0.324579 0.316525 0.294448 0.285519 0.331562 0.222470 0.311000 0.306366 0.267441 0.237279 0.245996 0.254469 0.306741 0.270908 0.388390 0.268032 0.311786 0.316543 0.217448
chargesum: 0.00000
title: Mulliken charges with hydrogens summed into heavy atoms:
elementType: S S O O O O O O N N N C C C C C C C C C C C C C C C C C C
charge: 0.144109 0.278316 -0.197102 -0.259443 -0.446363 -0.315707 -0.231202 -0.261742 -0.147911 -0.026465 -0.046548 -0.176018 0.126933 0.163280 0.161871 0.316058 -0.236437 0.069679 0.087746 0.298368 -0.241274 0.309467 -0.136838 -0.017013 0.113893 0.091426 0.214939 0.138168 0.225810
polarizability: 3.18893116e+02 -3.37800581e+00 2.85537161e+02 -7.98385412e+00 -1.89681737e+01 2.09181155e+02
1716.lowfreq: -7.5945 -0.0020 -0.0007 0.0003 1.8157 4.9372 25.3223 36.1372 40.3350
frequency: 24.8996 36.1124 40.1693 42.8018 51.2543 56.2535 62.7545 70.6889 80.5079 89.2494 102.5010 111.8818 119.5686 126.4769 128.9384 140.9964 154.0121 166.1376 191.0739 196.9386 201.2216 220.8870 255.5658 264.4054 267.3681 273.5621 291.9079 314.0549 325.4412 341.7126 371.3572 383.7613 391.1205 399.4106 402.2657 417.9889 441.4204 469.5345 511.1036 526.8172 543.0433 565.1644 568.8048 594.5790 619.5846 624.8023 644.6785 652.6073 658.9499 659.9824 667.8292 703.7090 717.3163 723.6266 745.8700 755.7104 763.7204 781.9033 791.8470 830.6345 869.5125 873.1626 881.3994 896.1510 910.5437 929.3475 952.6686 959.8214 974.4338 985.3659 999.0472 1023.8017 1030.0297 1040.8970 1050.5007 1067.5628 1078.1873 1083.4905 1086.1022 1124.9760 1132.0947 1143.3210 1157.2172 1170.4242 1175.2566 1193.9830 1206.5413 1210.5561 1219.6706 1227.5190 1234.5130 1243.6004 1251.7478 1261.0533 1281.6518 1291.8971 1303.0473 1314.7371 1348.4633 1354.7547 1380.3138 1428.0692 1430.0990 1438.5353 1441.5826 1446.4980 1452.3092 1454.0164 1456.9095 1473.0239 1485.6891 1494.7174 1539.2434 1543.9304 1605.9821 1622.4746 1628.2656 1631.6033 1712.8152 2990.2690 3004.8480 3010.4962 3019.9183 3026.0139 3035.9602 3077.5183 3089.4115 3095.3130 3099.1790 3109.6296 3111.0081 3117.6654 3123.6716 3138.5533 3177.6528 3180.8119 3201.6039 3430.9438
redmass: 4.1851 6.3782 2.7546 1.5147 8.1513 6.8946 3.1044 5.3194 3.8197 5.3844 6.4931 7.6446 3.1932 4.1490 4.4726 3.0752 5.1586 6.8720 7.2818 6.4849 7.5161 5.9851 3.9064 9.6134 4.4981 4.3118 6.0710 5.4167 4.7179 5.0575 7.0898 6.1138 4.9340 2.9268 3.4749 2.9957 5.5261 5.5215 3.3864 5.0926 4.6843 3.3249 4.2858 8.2697 3.3193 1.5465 6.2246 5.2477 6.5277 6.1972 4.9175 9.5407 4.0855 6.3039 6.8447 6.2460 6.4531 7.4370 5.6078 1.3569 4.6949 2.1329 2.0496 5.6391 1.2274 3.8644 3.2504 1.3709 3.6853 3.1444 1.9492 2.1001 3.0045 1.6641 1.5498 1.6189 3.7306 2.2378 3.9146 1.3741 1.2941 1.4111 1.2971 3.7633 1.5869 2.8407 1.4347 1.5548 2.6230 1.4658 1.2796 1.3603 1.3209 1.4370 2.5934 2.3544 1.5812 2.8155 1.4018 2.9397 1.2351 1.2067 1.1337 1.1142 1.5601 1.1192 1.0605 1.5297 1.0673 1.1671 1.7852 1.6907 5.1003 5.0031 8.3978 6.0445 6.9819 6.4334 12.5892 1.0344 1.0380 1.0623 1.0987 1.0616 1.0583 1.0887 1.1033 1.1096 1.0945 1.1033 1.0890 1.1067 1.1054 1.1023 1.0941 1.0902 1.0996 1.0786
irintensity: 1.1707 4.7044 3.4149 4.1302 0.6871 3.1442 2.0600 2.3431 0.6477 1.5456 2.2379 5.6755 3.3217 2.4735 0.1342 0.1229 7.0469 16.0235 5.1527 8.8097 8.4916 10.7083 12.4819 5.7229 1.4431 5.5817 5.1703 4.0557 7.9376 2.3708 4.4976 8.6702 4.1556 2.5526 15.3866 3.8394 11.1635 0.3983 43.4006 7.6318 10.5523 2.2143 2.5347 4.1665 12.3959 49.2430 4.8220 29.6982 15.6752 6.3739 11.3440 20.2679 4.8965 6.1406 8.9117 7.2715 7.5134 9.3460 11.7573 34.8022 6.0254 36.9689 3.1783 44.0464 33.2358 2.9238 32.4341 0.3164 25.9045 7.3773 36.4982 20.0643 44.0945 6.9201 12.6617 0.1183 1.9516 20.1155 26.2808 18.9311 10.6593 19.5110 6.4068 4.4242 22.8824 169.1588 22.7640 43.2133 101.2073 59.8225 1.1179 40.4743 5.7524 15.8028 38.4152 58.3249 17.7703 50.0343 47.4572 6.3785 58.0883 35.7653 19.3723 20.5670 33.9235 21.9177 29.2694 39.4887 25.9136 50.8717 51.6347 313.5152 173.0192 48.2865 26.9058 233.1111 178.3426 101.5014 487.3387 48.3414 4.3850 120.2540 152.5966 16.3721 10.7318 11.4115 16.7253 13.6538 10.0027 2.2204 5.3292 3.2191 13.4444 8.2569 11.0982 0.1352 0.5634 92.5914
temp: 298.150 k
press: 1.00000 atm
elementType: 16 16 8 8 8 8 8 8 7 7 7 6 6 6 6 6 6 6 6 6 6 6 6 6 6 6 6 6 6 1 1 1 1 1 1 1 1 1 1 1 1 1 1 1 1 1 1 1
symmnumber: 1
zpe: 926651.8 jmol-1
zpe.correction: 0.352943 hartree
zpe.thermalcorrener: 0.381640 hartree
zpe.thermalcorrenthalpy: 0.382584 hartree
zpe.thermalcorrgfe: 0.292372 hartree
zpe.sumelectzpe: -2106.864821 hartree
zpe.sumelectthermal: -2106.836124 hartree
zpe.sumelectthermalent: -2106.835180 hartree
zpe.sumelectthermalfe: -2106.925392 hartree
dipole: 2.4145 -3.3625 4.8626
dipole: 6.3861
quadrupole: -174.1876 -183.1241 -184.7413
quadrupole: 29.9629 6.8562 4.2536
quadrupole: 6.4968 -2.4398 -4.0570 29.9629 6.8562 4.2536
hfenergy: -2107.2177639 hartree
pointgroup: C01[X(C18H19N3O6S2)]
dipole: -0.2940937 -0.5924574 -2.4238377 debye
polarizability: 314.5291928|-7.6553914|265.5387901|20.7646421|38.0090693|233.5434487 unknown
InChI: InChI=1S/C18H19N3O6S2/c1-10(22)27-7-11-8-29-17-14(16(24)21(17)15(11)18(25)26)19-13(23)9-28-12-3-5-20(2)6-4-12/h3-6,14,17,19H,7-9H2,1-2H3
charge 0 multiplicity 1
48 atoms
S  1.644814 -2.862558 0.585708
S  -3.223299 -0.777169 -3.025836
O  -1.745576 0.458713 1.598027
O  4.095845 0.06128 -0.773292
O  1.461751 2.524187 0.853578
O  0.59634 2.035009 2.966497
O  -3.515074 -2.616413 -0.235779
O  1.944921 0.281188 -1.692318
N  0.409975 -0.662579 1.933092
N  -1.217207 -2.197324 -0.138896
N  -1.725081 2.670959 -0.326655
C  0.378522 -2.158861 1.804829
C  -1.106477 -2.050871 1.312121
C  -0.981632 -0.518641 1.670972
C  1.483327 0.226641 1.676695
C  2.697465 -0.2748 1.262411
C  3.03714 -1.743771 1.315559
C  3.70503 0.626557 0.589803
C  1.147895 1.729675 1.849386
C  -2.412748 -2.38737 -0.809241
C  -2.266886 -2.278192 -2.335966
C  3.15242 -0.047272 -1.785707
C  -2.56806 0.588671 -2.006014
C  3.794086 -0.65474 -3.020929
C  -1.19041 0.821342 -1.778269
C  -3.511139 1.46807 -1.412484
C  -0.786555 1.86333 -0.927291
C  -3.063838 2.490295 -0.574156
C  -1.304156 3.65991 0.713979
H  0.514517 -2.66115 2.773494
H  -1.881427 -2.635751 1.825842
H  3.189693 -2.11441 2.343584
H  3.928036 -1.979629 0.713482
H  -0.347081 -2.034724 -0.662574
H  4.688758 0.65373 1.087217
H  3.284447 1.636713 0.450912
H  -2.779074 -3.124894 -2.821308
H  -1.220923 -2.232786 -2.679234
H  3.173735 -0.442209 -3.90456
H  3.872033 -1.750464 -2.896375
H  4.812671 -0.261631 -3.164965
H  -0.396028 0.219486 -2.227061
H  -4.584018 1.315162 -1.548649
H  0.26695 2.04109 -0.652905
H  -3.751174 3.152109 -0.043789
H  -0.218627 3.833914 0.63243
H  -1.470167 3.203839 1.705662
H  -1.887607 4.586844 0.595681
