program: Gaussian 09
title: 000203489
version: EM64L-G09RevD.01
frameworkgroup: C1[X(C9H5Br2IN2OS)]
method: RPBEPBE
basis: SDD
operation: Freq
keyword: #p
keyword: freq=noraman
keyword: PBEPBE/SDD
title: #p freq=noraman PBEPBE/SDD
converged: YES YES NO NO
title: Mulliken charges:
elementType: I Br Br S O N N C C C C C C C C C H H H H H
charge: 0.076102 0.066813 0.082697 0.370434 -0.230578 -0.427168 0.029047 0.677028 -0.500444 -0.244220 -0.245582 -0.189602 -0.140440 0.287092 -0.853915 -0.327758 0.340246 0.299280 0.284027 0.323660 0.323283
chargesum: 0.00000
title: Mulliken charges with hydrogens summed into heavy atoms:
elementType: I Br Br S O N N C C C C C C C C C
charge: 0.076102 0.066813 0.082697 0.370434 -0.230578 -0.127888 0.029047 0.677028 -0.500444 0.096026 -0.245582 -0.189602 0.143586 0.287092 -0.206972 -0.327758
polarizability: 2.97046497e+02 -1.99650073e+01 1.97001953e+02 1.18778969e+01 -2.56341512e+00 9.29017457e+01
1716.lowfreq: -4.3183 -2.5865 -0.0020 -0.0015 -0.0009 1.9547 16.3809 22.9701 33.7465
frequency: 15.9890 22.9594 33.7110 49.7758 61.1384 68.3206 85.7430 94.5461 142.4246 155.8271 180.2471 203.6413 223.4749 245.7988 287.6816 348.8951 365.6199 367.8327 406.9022 445.7209 459.5331 479.7339 534.5007 550.0902 608.6675 629.0920 642.4510 660.3482 712.0414 728.2213 764.2351 838.7918 886.0882 886.3457 934.1441 941.3800 1012.3014 1110.7562 1148.6520 1195.8513 1219.1503 1239.0580 1250.6442 1347.3656 1361.6133 1409.6018 1434.1398 1490.3800 1556.0972 1576.4951 1599.9753 2108.8577 3065.6150 3144.0026 3176.2305 3182.1820 3386.5988
redmass: 12.4322 15.3856 9.4611 38.2722 3.8753 14.1961 33.8175 7.1147 17.0377 26.5204 7.0379 60.2318 5.4065 13.6486 13.8357 9.2415 10.6625 12.2278 9.0883 4.5101 5.2609 6.8340 7.2570 3.0059 12.9451 5.6646 7.7444 6.9702 2.5361 8.2527 1.4182 1.7538 1.5517 5.4154 1.4090 6.7405 6.5075 2.0528 1.1458 2.4775 1.4351 2.6832 1.2729 4.6907 9.8048 1.1076 2.6433 3.5984 3.6394 7.4634 6.3011 12.7529 1.0568 1.1072 1.0929 1.0929 1.0772
irintensity: 0.7413 1.6179 0.4469 0.1451 11.7583 2.4289 1.7202 1.8568 0.9886 0.9970 1.9168 0.1250 0.1405 4.9194 0.7373 1.1928 13.0316 1.0257 12.2115 9.2917 13.6686 10.7940 19.4445 0.3288 0.7418 76.5358 10.4217 26.6154 4.0001 6.5212 38.1596 31.5187 8.2305 21.9646 35.7544 4.5695 79.4223 6.3789 0.1037 17.2639 53.2950 18.5083 23.9249 156.7859 10.3779 38.6098 44.6828 608.7524 275.5150 193.7809 76.2701 15.1616 0.9377 0.6051 2.8014 26.3620 134.6865
temp: 298.150 k
press: 1.00000 atm
elementType: 53 35 35 16 8 7 7 6 6 6 6 6 6 6 6 6 1 1 1 1 1
symmnumber: 1
zpe: 317473.8 jmol-1
zpe.correction: 0.120919 hartree
zpe.thermalcorrener: 0.138098 hartree
zpe.thermalcorrenthalpy: 0.139042 hartree
zpe.thermalcorrgfe: 0.069376 hartree
zpe.sumelectzpe: -966.009343 hartree
zpe.sumelectthermal: -965.992164 hartree
zpe.sumelectthermalent: -965.991220 hartree
zpe.sumelectthermalfe: -966.060886 hartree
dipole: -4.4697 1.0397 -2.3165
dipole: 5.1405
quadrupole: -148.5779 -132.0184 -140.7793
quadrupole: 1.4407 -14.5238 -3.3751
quadrupole: -8.1194 8.4401 -0.3207 1.4407 -14.5238 -3.3751
hfenergy: -966.130262 hartree
pointgroup: C01 [X(C9H5Br2I1N2O1S1)]
dipole: -1.5686029 1.1257821 -0.6019682 debye
dipolederiv: -0.358063 0.1005933 0.0558502 0.3308592 -0.2991692 -0.0828237 0.0932473 -0.0523268 -0.0602153 -0.1973589 0.2128298 0.0508234 0.2301576 -0.4966634 -0.0952946 0.070601 -0.1113758 -0.0014329 -0.1108541 0.2217479 0.0662578 0.2817012 -0.480447 -0.1446861 0.0724831 -0.1259841 -0.0067199 0.2281043 0.1256068 -0.1501901 0.151786 0.0873758 -0.009794 -0.2092857 -0.0150341 0.1828188 -0.8571727 0.3330286 0.1189202 -0.4896195 -0.9146632 -0.0589227 0.0008844 -0.1574092 -0.3576239 -2.082482 -0.2465342 0.1475655 -0.6440051 -0.6087959 0.0090646 0.1594971 -0.0242075 -0.2723116 -0.2557301 0.0181874 -0.055715 0.0858031 -0.1811322 0.0243084 -0.1687037 0.0154509 -0.2374132 1.4117385 0.2702973 -0.0922268 -0.0658123 -0.0665595 -0.015541 -0.1931047 -0.0758234 0.1672179 -0.1212838 -0.5159083 -0.1030453 -0.538492 0.8056146 0.1970773 -0.111486 0.2339086 -0.1271667 -0.5392258 0.1062695 0.0723357 0.2626678 -0.3068283 -0.1013297 0.1084258 -0.0577176 -0.1013679 0.2781856 0.1336379 0.0687875 -0.0237951 -0.2732579 0.0022004 0.1477677 0.0092606 -0.1932507 0.2641562 -0.514465 -0.1814347 -0.3205087 0.9636528 0.3020347 -0.0524511 0.2447392 -0.0281272 -0.0993036 0.0632326 -0.0142456 0.0539394 -0.1793372 -0.0461674 -0.016748 -0.0391448 -0.0092164 1.7929591 -0.1220522 -0.2124986 1.46482 0.9674358 -0.015667 -0.0037797 0.16055 0.2350936 -0.1176209 -0.1286592 -0.0012717 -0.637221 0.6378733 0.1769302 -0.0701042 0.1138532 0.01839 -0.1492139 -0.0924981 0.243638 -0.1772922 0.0135038 -0.0661813 0.2025815 -0.0529663 0.100341 0.2317553 -0.0333423 -0.015819 0.0345312 0.0970369 -0.013481 -0.0088328 -0.0064931 0.1781582 0.5013721 -0.0180981 -0.0306859 -0.0557269 0.2570729 0.002939 -0.041848 0.0030873 0.2574133 0.0901403 -0.0302144 0.0147118 -0.0410776 0.037947 -0.0256427 0.0067933 -0.0194431 0.1409245 0.0543717 0.0592948 0.0165841 0.0503022 -0.0416012 0.0488685 0.067067 -0.0047577 0.0588726 0.0355256 0.0570461 0.0016585 0.0469828 -0.0190578 -0.0878919 -0.0530041 -0.0381665 0.0556157 unknown
polarizability: 272.6001689|-46.7120201|218.5992752|-11.4730646|20.9481443|95.7507513 unknown
InChI: InChI=1S/C9H5Br2IN2OS/c10-5-2-8(16-4-13)6(11)1-7(5)14-9(15)3-12/h1-2,14H,3H2
charge 0 multiplicity 1
21 atoms
I  -5.19012 1.760117 0.839087
Br -0.872237 3.261971 0.474187
Br 2.113665 -2.59001 -0.907151
S  3.853379 0.40081 -0.768444
O  -2.806059 -1.838904 -0.097068
N  -2.184844 0.412505 0.204761
N  4.989456 -0.736363 1.706052
C  -0.788899 0.352004 -0.008152
C  -0.014138 1.545924 0.072794
C  -0.115078 -0.865759 -0.301564
C  2.03358 0.311541 -0.420224
C  1.276347 -0.879795 -0.509454
C  1.375222 1.527165 -0.125706
C  -3.0939 -0.631125 0.157572
C  -4.569645 -0.332655 0.438207
C  4.490903 -0.280218 0.716339
H  -0.702273 -1.783728 -0.364834
H  -2.569342 1.344076 0.419615
H  1.954653 2.450415 -0.048538
H  -4.884294 -0.902932 1.325523
H  -5.166279 -0.652939 -0.429102
