program: Gaussian 09
title: 000206356
version: EM64L-G09RevD.01
frameworkgroup: C1[X(C15H15NO5)]
method: RPBEPBE
basis: SDD
operation: Freq
keyword: #p
keyword: freq=noraman
keyword: PBEPBE/SDD
title: #p freq=noraman PBEPBE/SDD
converged: YES YES NO NO
title: Mulliken charges:
elementType: O O O O O N C C C C C C C C C C C C C C C H H H H H H H H H H H H H H H
charge: -0.249606 -0.258823 -0.238598 -0.278318 -0.231296 -0.277499 -0.086401 -0.415112 -0.335313 0.238320 0.423780 -0.318986 -0.344298 -0.410582 -0.335881 0.361925 -0.381253 0.212453 0.258423 -0.749910 -0.466868 0.266147 0.255013 0.269718 0.232566 0.231319 0.303774 0.247185 0.256853 0.302460 0.227581 0.255335 0.246184 0.252766 0.252607 0.284333
chargesum: 0.00000
title: Mulliken charges with hydrogens summed into heavy atoms:
elementType: O O O O O N C C C C C C C C C C C C C C C
charge: -0.249606 -0.258823 -0.238598 -0.278318 -0.231296 -0.277499 0.179746 0.109619 0.128572 0.238320 0.423780 -0.015212 -0.097112 -0.153729 -0.033421 0.361925 0.101663 0.212453 0.258423 0.001647 -0.182535
polarizability: 2.78188153e+02 -9.87408612e+00 1.75063803e+02 -1.65831049e+01 -8.89875329e+00 1.19807951e+02
1716.lowfreq: -6.1615 -4.5875 -0.0009 -0.0005 0.0003 2.4218 9.2415 19.5675 26.8878
frequency: 9.2165 19.3800 26.8693 47.6140 50.8011 66.9627 72.8018 80.2794 94.6202 106.7887 135.9228 181.2360 185.3332 218.7234 235.0632 261.0069 303.0732 306.2104 319.9172 368.0726 389.4227 399.5697 409.7340 414.8049 435.9157 526.4484 533.9793 551.2096 554.6064 569.8317 622.3106 636.5513 665.6618 675.1822 683.2244 704.0687 718.4654 729.1999 766.5192 824.1142 835.1919 853.5897 864.0074 887.8920 905.2855 928.1904 938.2668 962.7839 971.6276 984.6142 994.2023 995.9785 1006.0145 1028.0487 1039.0567 1066.7811 1093.0532 1114.2308 1126.4538 1155.7775 1179.5684 1182.6671 1195.1883 1212.8737 1228.6342 1258.8063 1279.3469 1307.5405 1318.2989 1333.9100 1344.8302 1362.0582 1371.6610 1382.1248 1383.9407 1427.9059 1445.5567 1452.1989 1453.8052 1458.9504 1495.6631 1503.0284 1580.1681 1622.6047 1654.0942 1694.6182 2134.5522 2964.1815 2991.9479 2996.1301 3008.2881 3063.7422 3064.4913 3068.9340 3096.3693 3106.4837 3144.3972 3160.4368 3164.2538 3192.5832 3210.8075 3418.9265
redmass: 5.4829 4.7833 7.6618 3.3766 3.9317 3.0526 1.4727 3.8952 3.7779 5.4599 4.7748 7.0407 4.7576 5.8686 4.5897 4.6498 5.2567 5.9493 2.7417 4.9463 5.7669 4.0611 5.3784 3.0911 2.4296 2.6633 4.4839 5.7412 3.1539 6.2172 7.0934 1.2348 7.5613 10.2295 1.2641 7.8109 3.8761 5.5357 6.4684 1.3482 5.4824 1.4943 3.0798 7.2217 5.5018 4.2904 2.0244 1.3519 2.5015 1.3224 2.0511 2.1039 2.6735 5.6290 1.6365 3.9162 2.2185 1.8796 1.4055 2.3636 2.5777 2.4568 1.7732 1.4287 1.1927 1.1690 1.2705 1.8250 1.5103 1.2946 1.2881 2.9528 1.3100 2.1733 1.6664 3.5109 1.0815 1.0615 1.0468 1.0821 1.7571 1.3555 7.6415 6.2492 9.5110 11.8320 5.9825 1.0657 1.0624 1.0578 1.0367 1.1019 1.0970 1.1048 1.0974 1.0911 1.1011 1.0900 1.0906 1.0953 1.0946 1.1598
irintensity: 0.3134 0.8547 2.5907 2.4865 0.7783 0.0441 0.2663 3.2570 1.4893 5.5575 3.8189 2.9696 0.2849 3.2026 2.3089 10.3102 6.5655 7.1066 11.7984 6.0917 0.3688 1.0510 1.0636 0.6272 12.0450 20.7111 4.6426 8.1566 0.1301 2.4007 2.6001 67.7210 31.3439 12.3371 64.1143 1.0852 0.0418 14.7731 5.9117 23.7477 17.3825 76.1532 8.3339 83.2321 109.8565 25.7458 32.8363 3.0512 65.8034 0.9333 81.7132 19.9314 33.0998 205.3472 9.3302 177.3490 101.6469 0.8738 15.2974 216.2023 382.5162 306.8684 44.4730 68.0123 1.3700 6.6115 6.7750 51.8071 29.1576 22.7846 8.0144 112.5570 1.0910 47.4076 23.8145 10.5884 12.1908 25.3241 18.6965 17.4395 337.7762 50.3679 0.7227 30.2734 215.8213 405.0363 1.5253 49.3575 28.0507 23.1474 1.8354 9.8428 6.3148 15.3921 6.8329 21.0901 11.0679 15.6862 0.8570 6.4679 3.5999 60.9488
temp: 298.150 k
press: 1.00000 atm
elementType: 8 8 8 8 8 7 6 6 6 6 6 6 6 6 6 6 6 6 6 6 6 1 1 1 1 1 1 1 1 1 1 1 1 1 1 1
symmnumber: 1
zpe: 715177.4 jmol-1
zpe.correction: 0.272397 hartree
zpe.thermalcorrener: 0.293008 hartree
zpe.thermalcorrenthalpy: 0.293952 hartree
zpe.thermalcorrgfe: 0.218467 hartree
zpe.sumelectzpe: -1009.857356 hartree
zpe.sumelectthermal: -1009.836745 hartree
zpe.sumelectthermalent: -1009.835801 hartree
zpe.sumelectthermalfe: -1009.911286 hartree
dipole: -1.7890 -2.9363 -0.0309
dipole: 3.4385
quadrupole: -86.5179 -141.9401 -117.1257
quadrupole: 17.3137 -3.7171 -1.4271
quadrupole: 28.6767 -26.7455 -1.9311 17.3137 -3.7171 -1.4271
hfenergy: -1010.1297529 hartree
pointgroup: C01 [X(C15H15N1O5)]
dipole: 0.7491532 0.9312451 0.6337796 debye
polarizability: 278.0057761|-18.6465342|148.316736|2.3018635|29.752191|146.7373949 unknown
InChI: InChI=1S/C15H15NO5/c1-3-8-19-10-14-9-16(15(18)21-14)12-4-6-13(7-5-12)20-11(2)17/h1,4-7,14H,8-10H2,2H3
charge 0 multiplicity 1
36 atoms
O  2.614857 -1.707293 -0.872077
O  3.802892 1.806165 -0.261956
O  0.676437 -2.580695 -1.839766
O  -4.974929 0.184504 0.16024
O  -5.151254 1.785654 1.880653
N  0.609945 -0.777887 -0.25967
C  2.948897 -0.506445 -0.05251
C  1.603844 -0.080456 0.585993
C  3.533008 0.560359 -1.000713
C  1.205258 -1.760191 -1.067439
C  -0.790372 -0.532742 -0.138941
C  -1.741673 -1.19937 -0.962573
C  -1.252969 0.403466 0.822997
C  -3.110322 -0.919797 -0.815164
C  -2.627164 0.686764 0.97317
C  -3.554249 0.01756 0.143686
C  5.212579 2.007062 0.123561
C  5.729482 1.036797 1.108778
C  -5.680014 1.052054 1.019919
C  -7.158687 0.939728 0.721128
C  6.177182 0.236086 1.933274
H  3.69288 -0.813086 0.6962
H  1.518954 -0.406898 1.639603
H  1.486944 1.015849 0.54307
H  2.789944 0.819464 -1.776684
H  4.445412 0.170245 -1.491201
H  -1.405292 -1.931462 -1.698689
H  -0.549988 0.927468 1.476583
H  -3.849947 -1.426196 -1.44242
H  -2.96371 1.408691 1.717177
H  5.855136 1.991277 -0.781593
H  5.233368 3.026322 0.546494
H  -7.720482 1.607112 1.389956
H  -7.496991 -0.10169 0.859778
H  -7.355805 1.210795 -0.330517
H  6.573027 -0.460615 2.650849
