program: Gaussian 09
title: 000202868
version: EM64L-G09RevD.01
frameworkgroup: C1[X(C10H12NO)]
method: RPBEPBE
basis: SDD
operation: Freq
keyword: #p
keyword: freq=noraman
keyword: PBEPBE/SDD
title: #p freq=noraman PBEPBE/SDD
converged: YES YES NO NO
title: Mulliken charges:
elementType: O N C C C C C C C C C C H H H H H H H H H H H H
charge: -0.473301 -0.121197 0.370425 -0.429636 -0.274531 -0.359081 -0.481706 -0.158318 -0.155827 -0.158157 0.249093 -0.411134 0.228488 0.302715 0.331188 0.215570 0.240735 0.267270 0.284530 0.278341 0.285544 0.278394 0.383093 0.307503
chargesum: 1.00000
title: Mulliken charges with hydrogens summed into heavy atoms:
elementType: O N C C C C C C C C C C
charge: -0.090208 -0.121197 0.370425 0.101567 0.056657 0.097224 0.070094 0.120023 0.129717 0.120237 0.249093 -0.103632
polarizability: 1.17405665e+02 3.92930828e-01 1.31567961e+02 1.66784533e+00 -1.12652195e+00 7.46710203e+01
1716.lowfreq: -9.3797 -4.9238 -2.2477 -0.0003 0.0004 0.0005 30.3301 50.9888 85.9788
frequency: 29.9166 50.9612 85.9779 134.6034 171.6939 208.0739 248.1467 269.7604 305.2795 317.1999 373.8810 390.1007 442.5583 467.3964 506.6586 574.1126 618.2474 677.4526 703.5065 720.2308 748.2561 779.2642 814.9906 845.6900 906.2027 948.2267 955.6191 963.7477 977.5463 1019.5681 1025.4878 1061.2652 1068.7740 1100.8645 1143.4236 1180.1657 1193.4153 1209.0243 1211.6273 1226.7234 1276.8113 1319.1100 1325.6865 1359.0621 1366.0305 1413.7137 1416.9424 1441.5298 1471.3278 1485.1274 1502.1993 1567.6826 1625.4584 2160.2152 2968.7616 2988.7359 3025.4035 3037.4509 3045.2193 3077.7859 3163.3391 3178.1335 3189.0136 3206.2403 3406.8669 3596.1044
redmass: 3.4191 4.1746 4.2782 3.3563 4.3391 3.0118 3.8337 3.3189 1.6959 1.6058 4.8113 2.4499 2.9877 2.8504 3.4914 3.6347 5.4249 1.2273 3.3208 1.2832 3.1975 1.6045 3.7263 2.3698 1.3898 1.8215 1.9634 3.5111 1.4541 2.8690 1.4500 2.3584 2.4571 2.5811 2.6993 1.1319 1.1820 1.1242 1.1350 1.9622 1.1748 1.6657 1.3423 2.2991 1.5381 1.3095 1.2737 1.6431 1.2299 1.0878 1.8304 6.3397 5.5401 5.8853 1.0611 1.0614 1.0599 1.1020 1.0984 1.1035 1.0933 1.0943 1.0935 1.1018 1.1652 1.0672
irintensity: 0.4454 0.2220 0.5305 8.6051 12.3805 7.0797 0.4317 7.7139 81.3043 71.5195 7.0001 7.9851 13.3666 6.2414 4.9491 4.3020 10.1038 58.4925 13.7358 39.9100 17.2595 60.6046 34.0640 12.4117 0.8208 0.8185 4.1778 5.5249 0.5551 58.9261 7.8016 9.3157 2.6485 6.1656 51.7100 8.4281 20.6113 1.8000 5.7999 0.4908 25.5610 3.8917 7.6836 3.5235 15.0358 5.8170 22.8033 16.9550 31.3324 6.9897 94.4799 25.5142 53.3770 22.3780 47.2311 7.6147 5.8172 27.4140 5.7357 0.6228 29.7495 7.0228 1.6041 0.4794 84.5460 27.3337
temp: 298.150 k
press: 1.00000 atm
elementType: 8 7 6 6 6 6 6 6 6 6 6 6 1 1 1 1 1 1 1 1 1 1 1 1
symmnumber: 1
zpe: 516126.4 jmol-1
zpe.correction: 0.196582 hartree
zpe.thermalcorrener: 0.208420 hartree
zpe.thermalcorrenthalpy: 0.209364 hartree
zpe.thermalcorrgfe: 0.157915 hartree
zpe.sumelectzpe: -517.038611 hartree
zpe.sumelectthermal: -517.026774 hartree
zpe.sumelectthermalent: -517.025830 hartree
zpe.sumelectthermalfe: -517.077278 hartree
dipole: -0.7361 1.1379 -1.6951
dipole: 2.1703
quadrupole: -39.3029 -42.0938 -65.0039
quadrupole: -4.5660 -0.4178 1.0978
quadrupole: 9.4973 6.7064 -16.2037 -4.5660 -0.4178 1.0978
hfenergy: -517.2351934 hartree
pointgroup: C01 [X(C10H12N1O1)]
dipole: -0.4158651 0.0657873 -0.7428164 debye
dipolederiv: -0.3787698 0.0441056 -0.0949178 0.0759956 -0.5593352 -0.1259876 -0.1998294 -0.1792127 -0.7127743 -0.2269469 0.1794154 -0.0005203 0.1029606 -0.4616251 0.0078862 0.0010376 -0.1413172 -0.1262078 0.5979702 0.0960869 0.0355215 -0.4600386 0.2028906 0.0077442 -0.0514145 0.0543028 0.0703388 -0.1820063 -0.0411423 -0.0340326 0.1171835 -0.1084039 -0.0054163 -0.1025662 0.0388011 0.0466782 -0.4299858 0.1092784 0.0269876 0.4182946 -0.100417 0.0164763 0.133131 0.010201 -0.044736 0.3097147 0.0449877 0.0687736 0.0818935 0.4160405 0.1390986 0.1126841 0.1320516 0.6115441 0.2551955 -0.1804016 0.0566147 -0.1972419 0.8753656 -0.1578122 0.019467 -0.0226904 0.3477897 0.0251059 -0.2949656 -0.0459782 0.1616903 0.200703 0.097728 0.0498548 0.0678047 0.007677 0.2881296 -0.0350608 -0.0036166 -0.0183033 0.2713449 0.097897 0.0089174 0.113076 0.011445 0.0854573 -0.0184562 0.0006414 -0.2608973 -0.319574 -0.0735184 -0.0723368 -0.0842313 -0.1031755 -0.1243229 0.0524502 -0.0010205 0.0730341 -0.3347275 0.0194861 -0.0226665 0.0296593 -0.206434 -0.1839745 0.0075705 0.0006686 -0.014358 -0.2076166 -0.0166227 -0.0091532 0.0654953 -0.1568167 0.0371153 0.0059598 -0.0187021 -0.0358939 0.070692 -0.0929129 0.0314149 -0.1135175 -0.0195904 0.030694 0.0245728 0.000741 -0.0242681 0.0997948 0.0566744 0.0374135 0.0865173 0.054151 0.2476464 0.0255454 0.0253455 -0.0033517 0.1164809 -0.0028426 0.0405007 -0.0033992 0.1539968 0.0776881 0.0447737 -0.067505 -0.0104504 -0.0555329 0.0909082 -0.0361799 0.042297 -0.1417453 -0.1288123 0.0500484 0.0446032 0.0684827 0.0388646 -0.0554545 -0.0102498 -0.0486019 0.0209072 -0.0172999 -0.0146332 -0.114056 0.0398933 0.0510631 0.0391401 -0.0425535 0.0313142 0.0867283 0.0579996 0.0235045 0.0841896 0.0083803 0.0005017 0.1022574 0.0434621 0.0719593 0.0478848 0.1158821 -0.0154163 0.0055855 -0.0326881 0.0557591 -0.0477772 -0.0194684 -0.0401565 0.147541 0.1018519 0.0259283 0.0072251 0.031655 0.0475457 -0.0349002 0.004422 -0.0378297 0.1358565 0.0377866 0.0007327 -0.008597 -0.0007244 0.1150726 -0.01601 -0.0077371 -0.0222976 0.1651202 0.1507778 -0.1219908 0.0265937 -0.1104494 0.2984973 -0.026798 0.0818658 -0.0056823 0.3406028 0.2531035 -0.0128934 0.0054548 -0.010798 0.2866158 -0.0192438 0.0099844 -0.0445433 0.2632188 unknown
polarizability: 124.3294991|-7.3792324|122.5671568|9.78236|1.9116132|76.7479902 unknown
InChI: InChI=1S/C10H12NO/c1-2-7-11-8-4-3-5-10(11)6-9-12/h1,3-5,8,12H,6-7,9H2
charge 1 multiplicity 1
24 atoms
O  2.364719 1.976831 1.187874
N  -0.801313 -0.497852 -0.562108
C  0.126712 0.462755 -0.166252
C  1.6044 0.126581 -0.186166
C  -0.367496 1.715959 0.26536
C  2.550778 1.336562 -0.121832
C  -0.357544 -1.888344 -0.980722
C  -2.158731 -0.247347 -0.548702
C  -1.749052 1.988405 0.275376
C  -2.660551 0.990192 -0.142034
C  0.115639 -2.691041 0.15257
C  0.503819 -3.404354 1.076796
H  1.857672 -0.44403 -1.099953
H  1.83048 -0.541192 0.669167
H  0.365928 2.440126 0.629436
H  2.337043 2.050635 -0.944487
H  3.586631 0.965168 -0.240709
H  -1.223734 -2.373873 -1.462307
H  0.423862 -1.789151 -1.753983
H  -2.809698 -1.065316 -0.863616
H  -2.1137 2.962022 0.615423
H  -3.739776 1.157495 -0.145193
H  3.136825 2.553698 1.408883
H  0.837687 -4.03443 1.88458
